+ case "${usergroup_phase}" in
+ local run_cmd
+ run_cmd=run_su
+ shift
+ run_su /opt/pkg/bin/bmake all BATCH=1 DEPENDS_TARGET=/nonexistent PYTHON_VERSION_REQD=311 WRKLOG=/tmp/bulklog/alacritty-0.13.2nb1/work.log
+ su pbulk -c '"$@"' make /opt/pkg/bin/bmake all BATCH=1 DEPENDS_TARGET=/nonexistent PYTHON_VERSION_REQD=311 WRKLOG=/tmp/bulklog/alacritty-0.13.2nb1/work.log
=> Bootstrap dependency digest>=20211023: found digest-20220214
===> Building for alacritty-0.13.2nb1
   Compiling proc-macro2 v1.0.79
   Compiling unicode-ident v1.0.12
   Compiling quote v1.0.35
   Compiling syn v2.0.53
   Compiling serde v1.0.197
   Compiling serde_derive v1.0.197
   Compiling libc v0.2.153
   Compiling cfg-if v1.0.0
   Compiling pkg-config v0.3.30
   Compiling cc v1.0.90
   Compiling bitflags v2.4.2
   Compiling log v0.4.21
   Compiling rustix v0.38.25
   Compiling errno v0.3.7
   Compiling once_cell v1.19.0
   Compiling libloading v0.8.3
   Compiling smallvec v1.13.1
   Compiling dlib v0.5.2
   Compiling wayland-sys v0.31.1
   Compiling autocfg v1.1.0
   Compiling wayland-backend v0.3.3
   Compiling cmake v0.1.50
   Compiling scoped-tls v1.0.1
   Compiling downcast-rs v1.2.0
   Compiling memchr v2.7.1
   Compiling quick-xml v0.31.0
error[E0425]: cannot find value `poll_fd` in this scope
  --> /home/pbulk/build/x11/alacritty/work/vendor/wayland-backend-0.3.3/src/rs/server_impl/common_poll.rs:52:57
   |
52 |         Ok(Self { state: Arc::new(Mutex::new(State::new(poll_fd))) })
   |                                                         ^^^^^^^ not found in this scope
...
63 |     pub fn poll_fd(&self) -> BorrowedFd {
   |            ------- a method by that name is available on `Self` here

error[E0425]: cannot find value `ret` in this scope
   --> /home/pbulk/build/x11/alacritty/work/vendor/wayland-backend-0.3.3/src/rs/server_impl/handle.rs:350:15
    |
350 |         match ret {
    |               ^^^ not found in this scope

error[E0599]: no associated item named `CMSG_CLOEXEC` found for struct `RecvFlags` in the current scope
   --> /home/pbulk/build/x11/alacritty/work/vendor/wayland-backend-0.3.3/src/rs/socket.rs:74:54
    |
74  |         let flags = RecvFlags::DONTWAIT | RecvFlags::CMSG_CLOEXEC;
    |                                                      ^^^^^^^^^^^^ associated item not found in `RecvFlags`
    |
note: if you're trying to build a new `RecvFlags` consider using one of the following associated functions:
      rustix::backend::net::send_recv::_::<impl RecvFlags>::empty
      rustix::backend::net::send_recv::_::<impl RecvFlags>::all
      rustix::backend::net::send_recv::_::<impl RecvFlags>::from_bits
      rustix::backend::net::send_recv::_::<impl RecvFlags>::from_bits_truncate
      and 2 others
   --> /home/pbulk/build/x11/alacritty/work/vendor/rustix-0.38.25/src/backend/libc/net/send_recv.rs:55:1
    |
55  | / bitflags! {
56  | |     /// `MSG_*` flags for use with [`recv`], [`recvfrom`], and related
57  | |     /// functions.
58  | |     ///
...   |
102 | |     }
103 | | }
    | |_^
    = note: this error originates in the macro `$crate::__impl_bitflags` which comes from the expansion of the macro `bitflags` (in Nightly builds, run with -Z macro-backtrace for more info)

error[E0599]: no method named `dispatch_all_clients` found for struct `common_poll::InnerBackend` in the current scope
   --> /home/pbulk/build/x11/alacritty/work/vendor/wayland-backend-0.3.3/src/rs/../server_api.rs:575:22
    |
575 |         self.backend.dispatch_all_clients(data)
    |                      ^^^^^^^^^^^^^^^^^^^^ help: there is a method with a similar name: `dispatch_client`
    |
   ::: /home/pbulk/build/x11/alacritty/work/vendor/wayland-backend-0.3.3/src/rs/server_impl/common_poll.rs:32:1
    |
32  | pub struct InnerBackend<D: 'static> {
    | ----------------------------------- method `dispatch_all_clients` not found for this struct

Some errors have detailed explanations: E0425, E0599.
For more information about an error, try `rustc --explain E0425`.
error: could not compile `wayland-backend` (lib) due to 4 previous errors
*** Error code 101

Stop.
bmake[1]: stopped in /data/jenkins/workspace/pkgsrc-upstream-trunk/x11/alacritty
*** Error code 1

Stop.
bmake: stopped in /data/jenkins/workspace/pkgsrc-upstream-trunk/x11/alacritty