+ case "${usergroup_phase}" in
+ local run_cmd
+ run_cmd=run_su
+ shift
+ run_su /opt/pkg/bin/bmake all BATCH=1 DEPENDS_TARGET=/nonexistent WRKLOG=/tmp/bulklog/rsftch-0.3.8/work.log
+ su pbulk -c '"$@"' make /opt/pkg/bin/bmake all BATCH=1 DEPENDS_TARGET=/nonexistent WRKLOG=/tmp/bulklog/rsftch-0.3.8/work.log
=> Bootstrap dependency digest>=20211023: found digest-20220214
===> Building for rsftch-0.3.8
   Compiling proc-macro2 v1.0.79
   Compiling unicode-ident v1.0.12
   Compiling quote v1.0.35
   Compiling syn v2.0.57
   Compiling libc v0.2.153
   Compiling thiserror v1.0.58
   Compiling once_cell v1.19.0
   Compiling tracing-core v0.1.32
   Compiling thiserror-impl v1.0.58
   Compiling tracing-attributes v0.1.27
   Compiling pin-project-lite v0.2.14
   Compiling heck v0.4.1
   Compiling enum-as-inner v0.6.0
   Compiling tracing v0.1.40
   Compiling byteorder v1.5.0
   Compiling libmacchina v7.2.2
   Compiling bitflags v2.5.0
   Compiling sysctl v0.5.5
error[E0433]: failed to resolve: maybe a missing crate `sys`?
  --> /home/pbulk/build/sysutils/rsftch/work/vendor/sysctl-0.5.5/src/lib.rs:77:9
   |
77 | pub use sys::ctl::*;
   |         ^^^ maybe a missing crate `sys`?
   |
   = help: consider adding `extern crate sys` to use the `sys` crate

error[E0433]: failed to resolve: maybe a missing crate `sys`?
  --> /home/pbulk/build/sysutils/rsftch/work/vendor/sysctl-0.5.5/src/lib.rs:78:9
   |
78 | pub use sys::ctl_iter::*;
   |         ^^^ maybe a missing crate `sys`?
   |
   = help: consider adding `extern crate sys` to use the `sys` crate

error[E0432]: unresolved imports `sys::ctl::*`, `sys::ctl_iter::*`
  --> /home/pbulk/build/sysutils/rsftch/work/vendor/sysctl-0.5.5/src/lib.rs:77:9
   |
77 | pub use sys::ctl::*;
   |         ^^^^^^^^^^^
78 | pub use sys::ctl_iter::*;
   |         ^^^^^^^^^^^^^^^^

Some errors have detailed explanations: E0432, E0433.
For more information about an error, try `rustc --explain E0432`.
error: could not compile `sysctl` (lib) due to 3 previous errors
*** Error code 101

Stop.
bmake[1]: stopped in /data/jenkins/workspace/pkgsrc-upstream-trunk/sysutils/rsftch
*** Error code 1

Stop.
bmake: stopped in /data/jenkins/workspace/pkgsrc-upstream-trunk/sysutils/rsftch