+ case "${usergroup_phase}" in
+ local run_cmd
+ run_cmd=run_su
+ shift
+ run_su /opt/pkg/bin/bmake all BATCH=1 DEPENDS_TARGET=/nonexistent WRKLOG=/tmp/bulklog/zeromq-4.3.4/work.log
+ su pbulk -c '"$@"' make /opt/pkg/bin/bmake all BATCH=1 DEPENDS_TARGET=/nonexistent WRKLOG=/tmp/bulklog/zeromq-4.3.4/work.log
=> Bootstrap dependency digest>=20211023: found digest-20220214
===> Building for zeromq-4.3.4
Making all in doc
gmake[1]: Entering directory '/home/pbulk/build/net/zeromq/work/zeromq-4.3.4/doc'
gmake[1]: Nothing to be done for 'all'.
gmake[1]: Leaving directory '/home/pbulk/build/net/zeromq/work/zeromq-4.3.4/doc'
gmake[1]: Entering directory '/home/pbulk/build/net/zeromq/work/zeromq-4.3.4'
  CXX      tools/curve_keygen.o
  CXX      src/libzmq_la-address.lo
  CXX      src/libzmq_la-channel.lo
  CXX      src/libzmq_la-client.lo
  CXX      src/libzmq_la-clock.lo
  CXX      src/libzmq_la-ctx.lo
  CXX      src/libzmq_la-curve_client.lo
In file included from /opt/tools/gcc13/include/c++/13.1.0/ext/alloc_traits.h:34,
                 from /opt/tools/gcc13/include/c++/13.1.0/bits/stl_tree.h:67,
                 from /opt/tools/gcc13/include/c++/13.1.0/map:62,
                 from src/metadata.hpp:33,
                 from src/msg.hpp:40,
                 from src/curve_client.cpp:35:
/opt/tools/gcc13/include/c++/13.1.0/bits/alloc_traits.h: In instantiation of 'struct std::__allocator_traits_base::__rebind<zmq::secure_allocator_t<unsigned char>, unsigned char, void>':
/opt/tools/gcc13/include/c++/13.1.0/bits/alloc_traits.h:94:11:   required by substitution of 'template<class _Alloc, class _Up> using std::__alloc_rebind = typename std::__allocator_traits_base::__rebind<_Alloc, _Up>::type [with _Alloc = zmq::secure_allocator_t<unsigned char>; _Up = unsigned char]'
/opt/tools/gcc13/include/c++/13.1.0/bits/alloc_traits.h:228:8:   required by substitution of 'template<class _Alloc> template<class _Tp> using std::allocator_traits< <template-parameter-1-1> >::rebind_alloc = std::__alloc_rebind<_Alloc, _Tp> [with _Tp = unsigned char; _Alloc = zmq::secure_allocator_t<unsigned char>]'
/opt/tools/gcc13/include/c++/13.1.0/ext/alloc_traits.h:126:65:   required from 'struct __gnu_cxx::__alloc_traits<zmq::secure_allocator_t<unsigned char>, unsigned char>::rebind<unsigned char>'
/opt/tools/gcc13/include/c++/13.1.0/bits/stl_vector.h:88:21:   required from 'struct std::_Vector_base<unsigned char, zmq::secure_allocator_t<unsigned char> >'
/opt/tools/gcc13/include/c++/13.1.0/bits/stl_vector.h:423:11:   required from 'class std::vector<unsigned char, zmq::secure_allocator_t<unsigned char> >'
src/curve_client_tools.hpp:64:76:   required from here
/opt/tools/gcc13/include/c++/13.1.0/bits/alloc_traits.h:70:31: error: static assertion failed: allocator_traits<A>::rebind_alloc<A::value_type> must be A
   70 |                         _Tp>::value,
      |                               ^~~~~
/opt/tools/gcc13/include/c++/13.1.0/bits/alloc_traits.h:70:31: note: 'std::integral_constant<bool, false>::value' evaluates to false
gmake[1]: *** [Makefile:5395: src/libzmq_la-curve_client.lo] Error 1
gmake[1]: Leaving directory '/home/pbulk/build/net/zeromq/work/zeromq-4.3.4'
gmake: *** [Makefile:8217: all-recursive] Error 1
*** Error code 2

Stop.
bmake[1]: stopped in /data/jenkins/workspace/pkgsrc-upstream-trunk/net/zeromq
*** Error code 1

Stop.
bmake: stopped in /data/jenkins/workspace/pkgsrc-upstream-trunk/net/zeromq