+ case "${usergroup_phase}" in
+ local run_cmd
+ run_cmd=run_su
+ shift
+ run_su /opt/pkg/bin/bmake all BATCH=1 DEPENDS_TARGET=/nonexistent WRKLOG=/tmp/bulklog/wabt-1.0.33/work.log
+ su pbulk -c '"$@"' make /opt/pkg/bin/bmake all BATCH=1 DEPENDS_TARGET=/nonexistent WRKLOG=/tmp/bulklog/wabt-1.0.33/work.log
=> Bootstrap dependency digest>=20211023: found digest-20220214
===> Building for wabt-1.0.33
[  1%] Generating gen-wasm2c-prebuilt
[  1%] Built target gen-wasm2c-prebuilt-target
[  2%] Building C object CMakeFiles/wasm-rt-impl.dir/wasm2c/wasm-rt-impl.c.o
In file included from /home/pbulk/build/devel/wabt/work/wabt-1.0.33/wasm2c/wasm-rt-impl.h:20,
                 from /home/pbulk/build/devel/wabt/work/wabt-1.0.33/wasm2c/wasm-rt-impl.c:17:
/home/pbulk/build/devel/wabt/work/wabt-1.0.33/wasm2c/wasm-rt-impl.c: In function 'wasm_rt_trap':
/home/pbulk/build/devel/wabt/work/wabt-1.0.33/wasm2c/wasm-rt.h:340:45: warning: 'siglongjmp' accessing 1024 bytes in a region of size 64 [-Wstringop-overflow=]
  340 | #define WASM_RT_LONGJMP_UNCHECKED(buf, val) siglongjmp(buf, val)
      |                                             ^~~~~~~~~~~~~~~~~~~~
/home/pbulk/build/devel/wabt/work/wabt-1.0.33/wasm2c/wasm-rt.h:350:3: note: in expansion of macro 'WASM_RT_LONGJMP_UNCHECKED'
  350 |   WASM_RT_LONGJMP_UNCHECKED((buf).buffer, val)
      |   ^~~~~~~~~~~~~~~~~~~~~~~~~
/home/pbulk/build/devel/wabt/work/wabt-1.0.33/wasm2c/wasm-rt-impl.c:75:3: note: in expansion of macro 'WASM_RT_LONGJMP'
   75 |   WASM_RT_LONGJMP(g_wasm_rt_jmp_buf, code);
      |   ^~~~~~~~~~~~~~~
/home/pbulk/build/devel/wabt/work/wabt-1.0.33/wasm2c/wasm-rt.h:340:45: note: referencing argument 1 of type 'long int[128]'
  340 | #define WASM_RT_LONGJMP_UNCHECKED(buf, val) siglongjmp(buf, val)
      |                                             ^~~~~~~~~~~~~~~~~~~~
/home/pbulk/build/devel/wabt/work/wabt-1.0.33/wasm2c/wasm-rt.h:350:3: note: in expansion of macro 'WASM_RT_LONGJMP_UNCHECKED'
  350 |   WASM_RT_LONGJMP_UNCHECKED((buf).buffer, val)
      |   ^~~~~~~~~~~~~~~~~~~~~~~~~
/home/pbulk/build/devel/wabt/work/wabt-1.0.33/wasm2c/wasm-rt-impl.c:75:3: note: in expansion of macro 'WASM_RT_LONGJMP'
   75 |   WASM_RT_LONGJMP(g_wasm_rt_jmp_buf, code);
      |   ^~~~~~~~~~~~~~~
In file included from /home/pbulk/build/devel/wabt/work/wabt-1.0.33/wasm2c/wasm-rt.h:20:
/usr/include/setjmp.h:62:13: note: in a call to function 'siglongjmp'
   62 | extern void siglongjmp(sigjmp_buf, int) __NORETURN;
      |             ^~~~~~~~~~
/home/pbulk/build/devel/wabt/work/wabt-1.0.33/wasm2c/wasm-rt.h:340:45: warning: 'siglongjmp' accessing 1024 bytes in a region of size 64 [-Wstringop-overflow=]
  340 | #define WASM_RT_LONGJMP_UNCHECKED(buf, val) siglongjmp(buf, val)
      |                                             ^~~~~~~~~~~~~~~~~~~~
/home/pbulk/build/devel/wabt/work/wabt-1.0.33/wasm2c/wasm-rt.h:350:3: note: in expansion of macro 'WASM_RT_LONGJMP_UNCHECKED'
  350 |   WASM_RT_LONGJMP_UNCHECKED((buf).buffer, val)
      |   ^~~~~~~~~~~~~~~~~~~~~~~~~
/home/pbulk/build/devel/wabt/work/wabt-1.0.33/wasm2c/wasm-rt-impl.c:75:3: note: in expansion of macro 'WASM_RT_LONGJMP'
   75 |   WASM_RT_LONGJMP(g_wasm_rt_jmp_buf, code);
      |   ^~~~~~~~~~~~~~~
/home/pbulk/build/devel/wabt/work/wabt-1.0.33/wasm2c/wasm-rt.h:340:45: note: referencing argument 1 of type 'long int[128]'
  340 | #define WASM_RT_LONGJMP_UNCHECKED(buf, val) siglongjmp(buf, val)
      |                                             ^~~~~~~~~~~~~~~~~~~~
/home/pbulk/build/devel/wabt/work/wabt-1.0.33/wasm2c/wasm-rt.h:350:3: note: in expansion of macro 'WASM_RT_LONGJMP_UNCHECKED'
  350 |   WASM_RT_LONGJMP_UNCHECKED((buf).buffer, val)
      |   ^~~~~~~~~~~~~~~~~~~~~~~~~
/home/pbulk/build/devel/wabt/work/wabt-1.0.33/wasm2c/wasm-rt-impl.c:75:3: note: in expansion of macro 'WASM_RT_LONGJMP'
   75 |   WASM_RT_LONGJMP(g_wasm_rt_jmp_buf, code);
      |   ^~~~~~~~~~~~~~~
/usr/include/setjmp.h:62:13: note: in a call to function 'siglongjmp'
   62 | extern void siglongjmp(sigjmp_buf, int) __NORETURN;
      |             ^~~~~~~~~~
/home/pbulk/build/devel/wabt/work/wabt-1.0.33/wasm2c/wasm-rt.h:340:45: warning: 'siglongjmp' accessing 1024 bytes in a region of size 64 [-Wstringop-overflow=]
  340 | #define WASM_RT_LONGJMP_UNCHECKED(buf, val) siglongjmp(buf, val)
      |                                             ^~~~~~~~~~~~~~~~~~~~
/home/pbulk/build/devel/wabt/work/wabt-1.0.33/wasm2c/wasm-rt.h:350:3: note: in expansion of macro 'WASM_RT_LONGJMP_UNCHECKED'
  350 |   WASM_RT_LONGJMP_UNCHECKED((buf).buffer, val)
      |   ^~~~~~~~~~~~~~~~~~~~~~~~~
/home/pbulk/build/devel/wabt/work/wabt-1.0.33/wasm2c/wasm-rt-impl.c:75:3: note: in expansion of macro 'WASM_RT_LONGJMP'
   75 |   WASM_RT_LONGJMP(g_wasm_rt_jmp_buf, code);
      |   ^~~~~~~~~~~~~~~
/home/pbulk/build/devel/wabt/work/wabt-1.0.33/wasm2c/wasm-rt.h:340:45: note: referencing argument 1 of type 'long int[128]'
  340 | #define WASM_RT_LONGJMP_UNCHECKED(buf, val) siglongjmp(buf, val)
      |                                             ^~~~~~~~~~~~~~~~~~~~
/home/pbulk/build/devel/wabt/work/wabt-1.0.33/wasm2c/wasm-rt.h:350:3: note: in expansion of macro 'WASM_RT_LONGJMP_UNCHECKED'
  350 |   WASM_RT_LONGJMP_UNCHECKED((buf).buffer, val)
      |   ^~~~~~~~~~~~~~~~~~~~~~~~~
/home/pbulk/build/devel/wabt/work/wabt-1.0.33/wasm2c/wasm-rt-impl.c:75:3: note: in expansion of macro 'WASM_RT_LONGJMP'
   75 |   WASM_RT_LONGJMP(g_wasm_rt_jmp_buf, code);
      |   ^~~~~~~~~~~~~~~
/usr/include/setjmp.h:62:13: note: in a call to function 'siglongjmp'
   62 | extern void siglongjmp(sigjmp_buf, int) __NORETURN;
      |             ^~~~~~~~~~
[  3%] Building C object CMakeFiles/wasm-rt-impl.dir/wasm2c/wasm-rt-exceptions-impl.c.o
In file included from /home/pbulk/build/devel/wabt/work/wabt-1.0.33/wasm2c/wasm-rt-exceptions-impl.c:17:
/home/pbulk/build/devel/wabt/work/wabt-1.0.33/wasm2c/wasm-rt-exceptions-impl.c: In function 'wasm_rt_throw':
/home/pbulk/build/devel/wabt/work/wabt-1.0.33/wasm2c/wasm-rt.h:340:45: warning: 'siglongjmp' accessing 1024 bytes in a region of size 64 [-Wstringop-overflow=]
  340 | #define WASM_RT_LONGJMP_UNCHECKED(buf, val) siglongjmp(buf, val)
      |                                             ^~~~~~~~~~~~~~~~~~~~
/home/pbulk/build/devel/wabt/work/wabt-1.0.33/wasm2c/wasm-rt.h:350:3: note: in expansion of macro 'WASM_RT_LONGJMP_UNCHECKED'
  350 |   WASM_RT_LONGJMP_UNCHECKED((buf).buffer, val)
      |   ^~~~~~~~~~~~~~~~~~~~~~~~~
/home/pbulk/build/devel/wabt/work/wabt-1.0.33/wasm2c/wasm-rt-exceptions-impl.c:47:3: note: in expansion of macro 'WASM_RT_LONGJMP'
   47 |   WASM_RT_LONGJMP(*g_unwind_target, WASM_RT_TRAP_UNCAUGHT_EXCEPTION);
      |   ^~~~~~~~~~~~~~~
/home/pbulk/build/devel/wabt/work/wabt-1.0.33/wasm2c/wasm-rt.h:340:45: note: referencing argument 1 of type 'long int[128]'
  340 | #define WASM_RT_LONGJMP_UNCHECKED(buf, val) siglongjmp(buf, val)
      |                                             ^~~~~~~~~~~~~~~~~~~~
/home/pbulk/build/devel/wabt/work/wabt-1.0.33/wasm2c/wasm-rt.h:350:3: note: in expansion of macro 'WASM_RT_LONGJMP_UNCHECKED'
  350 |   WASM_RT_LONGJMP_UNCHECKED((buf).buffer, val)
      |   ^~~~~~~~~~~~~~~~~~~~~~~~~
/home/pbulk/build/devel/wabt/work/wabt-1.0.33/wasm2c/wasm-rt-exceptions-impl.c:47:3: note: in expansion of macro 'WASM_RT_LONGJMP'
   47 |   WASM_RT_LONGJMP(*g_unwind_target, WASM_RT_TRAP_UNCAUGHT_EXCEPTION);
      |   ^~~~~~~~~~~~~~~
In file included from /home/pbulk/build/devel/wabt/work/wabt-1.0.33/wasm2c/wasm-rt.h:20:
/usr/include/setjmp.h:62:13: note: in a call to function 'siglongjmp'
   62 | extern void siglongjmp(sigjmp_buf, int) __NORETURN;
      |             ^~~~~~~~~~
/home/pbulk/build/devel/wabt/work/wabt-1.0.33/wasm2c/wasm-rt.h:340:45: warning: 'siglongjmp' accessing 1024 bytes in a region of size 64 [-Wstringop-overflow=]
  340 | #define WASM_RT_LONGJMP_UNCHECKED(buf, val) siglongjmp(buf, val)
      |                                             ^~~~~~~~~~~~~~~~~~~~
/home/pbulk/build/devel/wabt/work/wabt-1.0.33/wasm2c/wasm-rt.h:350:3: note: in expansion of macro 'WASM_RT_LONGJMP_UNCHECKED'
  350 |   WASM_RT_LONGJMP_UNCHECKED((buf).buffer, val)
      |   ^~~~~~~~~~~~~~~~~~~~~~~~~
/home/pbulk/build/devel/wabt/work/wabt-1.0.33/wasm2c/wasm-rt-exceptions-impl.c:47:3: note: in expansion of macro 'WASM_RT_LONGJMP'
   47 |   WASM_RT_LONGJMP(*g_unwind_target, WASM_RT_TRAP_UNCAUGHT_EXCEPTION);
      |   ^~~~~~~~~~~~~~~
/home/pbulk/build/devel/wabt/work/wabt-1.0.33/wasm2c/wasm-rt.h:340:45: note: referencing argument 1 of type 'long int[128]'
  340 | #define WASM_RT_LONGJMP_UNCHECKED(buf, val) siglongjmp(buf, val)
      |                                             ^~~~~~~~~~~~~~~~~~~~
/home/pbulk/build/devel/wabt/work/wabt-1.0.33/wasm2c/wasm-rt.h:350:3: note: in expansion of macro 'WASM_RT_LONGJMP_UNCHECKED'
  350 |   WASM_RT_LONGJMP_UNCHECKED((buf).buffer, val)
      |   ^~~~~~~~~~~~~~~~~~~~~~~~~
/home/pbulk/build/devel/wabt/work/wabt-1.0.33/wasm2c/wasm-rt-exceptions-impl.c:47:3: note: in expansion of macro 'WASM_RT_LONGJMP'
   47 |   WASM_RT_LONGJMP(*g_unwind_target, WASM_RT_TRAP_UNCAUGHT_EXCEPTION);
      |   ^~~~~~~~~~~~~~~
/usr/include/setjmp.h:62:13: note: in a call to function 'siglongjmp'
   62 | extern void siglongjmp(sigjmp_buf, int) __NORETURN;
      |             ^~~~~~~~~~
/home/pbulk/build/devel/wabt/work/wabt-1.0.33/wasm2c/wasm-rt.h:340:45: warning: 'siglongjmp' accessing 1024 bytes in a region of size 64 [-Wstringop-overflow=]
  340 | #define WASM_RT_LONGJMP_UNCHECKED(buf, val) siglongjmp(buf, val)
      |                                             ^~~~~~~~~~~~~~~~~~~~
/home/pbulk/build/devel/wabt/work/wabt-1.0.33/wasm2c/wasm-rt.h:350:3: note: in expansion of macro 'WASM_RT_LONGJMP_UNCHECKED'
  350 |   WASM_RT_LONGJMP_UNCHECKED((buf).buffer, val)
      |   ^~~~~~~~~~~~~~~~~~~~~~~~~
/home/pbulk/build/devel/wabt/work/wabt-1.0.33/wasm2c/wasm-rt-exceptions-impl.c:47:3: note: in expansion of macro 'WASM_RT_LONGJMP'
   47 |   WASM_RT_LONGJMP(*g_unwind_target, WASM_RT_TRAP_UNCAUGHT_EXCEPTION);
      |   ^~~~~~~~~~~~~~~
/home/pbulk/build/devel/wabt/work/wabt-1.0.33/wasm2c/wasm-rt.h:340:45: note: referencing argument 1 of type 'long int[128]'
  340 | #define WASM_RT_LONGJMP_UNCHECKED(buf, val) siglongjmp(buf, val)
      |                                             ^~~~~~~~~~~~~~~~~~~~
/home/pbulk/build/devel/wabt/work/wabt-1.0.33/wasm2c/wasm-rt.h:350:3: note: in expansion of macro 'WASM_RT_LONGJMP_UNCHECKED'
  350 |   WASM_RT_LONGJMP_UNCHECKED((buf).buffer, val)
      |   ^~~~~~~~~~~~~~~~~~~~~~~~~
/home/pbulk/build/devel/wabt/work/wabt-1.0.33/wasm2c/wasm-rt-exceptions-impl.c:47:3: note: in expansion of macro 'WASM_RT_LONGJMP'
   47 |   WASM_RT_LONGJMP(*g_unwind_target, WASM_RT_TRAP_UNCAUGHT_EXCEPTION);
      |   ^~~~~~~~~~~~~~~
/usr/include/setjmp.h:62:13: note: in a call to function 'siglongjmp'
   62 | extern void siglongjmp(sigjmp_buf, int) __NORETURN;
      |             ^~~~~~~~~~
[  5%] Linking C static library libwasm-rt-impl.a
[  5%] Built target wasm-rt-impl
[  6%] Building CXX object CMakeFiles/wabt.dir/src/apply-names.cc.o
[  7%] Building CXX object CMakeFiles/wabt.dir/src/binary-reader-ir.cc.o
[  8%] Building CXX object CMakeFiles/wabt.dir/src/binary-reader-logging.cc.o
[ 10%] Building CXX object CMakeFiles/wabt.dir/src/binary-reader.cc.o
[ 11%] Building CXX object CMakeFiles/wabt.dir/src/binary-writer-spec.cc.o
[ 12%] Building CXX object CMakeFiles/wabt.dir/src/binary-writer.cc.o
[ 13%] Building CXX object CMakeFiles/wabt.dir/src/binary.cc.o
[ 15%] Building CXX object CMakeFiles/wabt.dir/src/binding-hash.cc.o
[ 16%] Building CXX object CMakeFiles/wabt.dir/src/color.cc.o
[ 17%] Building CXX object CMakeFiles/wabt.dir/src/common.cc.o
[ 18%] Building CXX object CMakeFiles/wabt.dir/src/config.cc.o
[ 20%] Building CXX object CMakeFiles/wabt.dir/src/decompiler.cc.o
[ 21%] Building CXX object CMakeFiles/wabt.dir/src/error-formatter.cc.o
[ 22%] Building CXX object CMakeFiles/wabt.dir/src/expr-visitor.cc.o
[ 24%] Building CXX object CMakeFiles/wabt.dir/src/feature.cc.o
[ 25%] Building CXX object CMakeFiles/wabt.dir/src/filenames.cc.o
[ 26%] Building CXX object CMakeFiles/wabt.dir/src/generate-names.cc.o
[ 27%] Building CXX object CMakeFiles/wabt.dir/src/ir-util.cc.o
[ 29%] Building CXX object CMakeFiles/wabt.dir/src/ir.cc.o
[ 30%] Building CXX object CMakeFiles/wabt.dir/src/leb128.cc.o
[ 31%] Building CXX object CMakeFiles/wabt.dir/src/lexer-source-line-finder.cc.o
[ 32%] Building CXX object CMakeFiles/wabt.dir/src/lexer-source.cc.o
[ 34%] Building CXX object CMakeFiles/wabt.dir/src/literal.cc.o
[ 35%] Building C object CMakeFiles/wabt.dir/src/opcode-code-table.c.o
[ 36%] Building CXX object CMakeFiles/wabt.dir/src/opcode.cc.o
[ 37%] Building CXX object CMakeFiles/wabt.dir/src/option-parser.cc.o
[ 39%] Building CXX object CMakeFiles/wabt.dir/src/resolve-names.cc.o
[ 40%] Building CXX object CMakeFiles/wabt.dir/src/sha256.cc.o
/home/pbulk/build/devel/wabt/work/wabt-1.0.33/src/sha256.cc:22:10: fatal error: picosha2.h: No such file or directory
   22 | #include "picosha2.h"
      |          ^~~~~~~~~~~~
compilation terminated.
*** [CMakeFiles/wabt.dir/src/sha256.cc.o] Error code 1

bmake[2]: stopped in /home/pbulk/build/devel/wabt/work/build
1 error

bmake[2]: stopped in /home/pbulk/build/devel/wabt/work/build
*** [CMakeFiles/wabt.dir/all] Error code 2

bmake[1]: stopped in /home/pbulk/build/devel/wabt/work/build
1 error

bmake[1]: stopped in /home/pbulk/build/devel/wabt/work/build
*** [all] Error code 2

bmake: stopped in /home/pbulk/build/devel/wabt/work/build
1 error

bmake: stopped in /home/pbulk/build/devel/wabt/work/build
*** Error code 2

Stop.
bmake[1]: stopped in /data/jenkins/workspace/pkgsrc-upstream-trunk/devel/wabt
*** Error code 1

Stop.
bmake: stopped in /data/jenkins/workspace/pkgsrc-upstream-trunk/devel/wabt