+ case "${usergroup_phase}" in
+ local run_cmd
+ run_cmd=run_su
+ shift
+ run_su /opt/pkg/bin/bmake all BATCH=1 DEPENDS_TARGET=/nonexistent WRKLOG=/tmp/bulklog/arti-1.1.2/work.log
+ su pbulk -c '"$@"' make /opt/pkg/bin/bmake all BATCH=1 DEPENDS_TARGET=/nonexistent WRKLOG=/tmp/bulklog/arti-1.1.2/work.log
=> Bootstrap dependency digest>=20211023: found digest-20220214
===> Building for arti-1.1.2
   Compiling libc v0.2.139
   Compiling proc-macro2 v1.0.51
   Compiling unicode-ident v1.0.6
   Compiling quote v1.0.23
   Compiling syn v1.0.109
   Compiling autocfg v1.1.0
   Compiling cfg-if v1.0.0
   Compiling memchr v2.5.0
   Compiling jobserver v0.1.25
   Compiling cc v1.0.79
   Compiling version_check v0.9.4
   Compiling once_cell v1.17.1
   Compiling thiserror v1.0.38
   Compiling thiserror-impl v1.0.38
   Compiling log v0.4.17
   Compiling typenum v1.16.0
   Compiling pin-project-lite v0.2.9
   Compiling generic-array v0.14.6
   Compiling smallvec v1.10.0
   Compiling futures-core v0.3.26
   Compiling getrandom v0.2.8
   Compiling serde_derive v1.0.152
   Compiling spin v0.5.2
   Compiling serde v1.0.152
   Compiling unicode-xid v0.2.4
   Compiling synstructure v0.12.6
   Compiling slab v0.4.8
   Compiling futures-io v0.3.26
   Compiling futures-task v0.3.26
   Compiling futures-sink v0.3.26
   Compiling futures-channel v0.3.26
   Compiling zeroize_derive v1.3.3
   Compiling pkg-config v0.3.26
   Compiling futures-util v0.3.26
   Compiling zeroize v1.5.7
   Compiling futures-macro v0.3.26
   Compiling pin-utils v0.1.0
   Compiling num-traits v0.2.15
   Compiling const-oid v0.9.2
   Compiling lazy_static v1.4.0
   Compiling crypto-common v0.1.6
   Compiling num-integer v0.1.45
   Compiling subtle v2.4.1
   Compiling num-bigint v0.4.3
   Compiling bytes v1.4.0
   Compiling ppv-lite86 v0.2.17
   Compiling rand_core v0.6.4
   Compiling lock_api v0.4.9
   Compiling libm v0.2.6
   Compiling getrandom v0.1.16
   Compiling itoa v1.0.5
   Compiling parking_lot_core v0.9.7
   Compiling block-buffer v0.10.3
   Compiling scopeguard v1.1.0
   Compiling digest v0.10.6
   Compiling enum-ordinalize v3.1.12
   Compiling parking_lot v0.12.1
   Compiling rand_core v0.5.1
   Compiling educe v0.4.20
   Compiling rand_chacha v0.3.1
   Compiling convert_case v0.4.0
   Compiling bitflags v1.3.2
   Compiling regex-syntax v0.6.28
   Compiling base64ct v1.6.0
   Compiling byteorder v1.4.3
   Compiling pem-rfc7468 v0.6.0
   Compiling derive_more v0.99.17
   Compiling rand v0.8.5
   Compiling futures-executor v0.3.26
   Compiling time-core v0.1.0
   Compiling cpufeatures v0.2.5
   Compiling time-macros v0.2.8
   Compiling futures v0.3.26
   Compiling der v0.6.1
   Compiling digest v0.9.0
   Compiling aho-corasick v0.7.20
   Compiling num-iter v0.1.43
   Compiling strsim v0.10.0
   Compiling either v1.8.1
   Compiling ident_case v1.0.1
   Compiling fnv v1.0.7
   Compiling time v0.3.20
   Compiling darling_core v0.14.3
   Compiling regex v1.7.1
   Compiling spki v0.6.0
   Compiling inout v0.1.3
   Compiling keccak v0.1.3
   Compiling adler v1.0.2
   Compiling rustversion v1.0.11
   Compiling heck v0.4.1
   Compiling num-bigint-dig v0.8.2
   Compiling miniz_oxide v0.6.2
   Compiling cipher v0.4.3
   Compiling pkcs8 v0.9.0
   Compiling darling_macro v0.14.3
   Compiling curve25519-dalek v3.2.0
   Compiling rand_chacha v0.2.2
   Compiling block-buffer v0.9.0
   Compiling tracing-core v0.1.30
   Compiling ahash v0.7.6
   Compiling signature v1.6.4
   Compiling opaque-debug v0.3.0
   Compiling hex v0.4.3
   Compiling sha2 v0.9.9
   Compiling ed25519 v1.5.3
   Compiling rand v0.7.3
   Compiling darling v0.14.3
   Compiling pkcs1 v0.4.1
   Compiling merlin v2.0.1
   Compiling signature v2.0.0
   Compiling backtrace v0.3.67
   Compiling tracing-attributes v0.1.23
   Compiling fluid-let v1.0.0
   Compiling gimli v0.27.2
   Compiling addr2line v0.19.0
   Compiling safelog v0.2.1 (/home/pbulk/build/net/arti/work/arti-arti-v1.1.2/crates/safelog)
   Compiling tracing v0.1.37
   Compiling rsa v0.8.1
   Compiling ed25519-dalek v1.0.1
   Compiling strum_macros v0.24.3
   Compiling simple_asn1 v0.6.2
   Compiling x25519-dalek v2.0.0-pre.1
   Compiling aes v0.8.2
   Compiling ctr v0.9.2
   Compiling sha3 v0.10.6
   Compiling sha2 v0.10.6
   Compiling sha1 v0.10.5
   Compiling object v0.30.3
   Compiling tokio v1.25.0
   Compiling crossbeam-utils v0.8.14
   Compiling rustc-demangle v0.1.21
   Compiling arrayref v0.3.6
   Compiling tor-llcrypto v0.4.2 (/home/pbulk/build/net/arti/work/arti-arti-v1.1.2/crates/tor-llcrypto)
   Compiling hashbrown v0.12.3
   Compiling strum v0.24.1
   Compiling mio v0.8.6
   Compiling socket2 v0.4.7
   Compiling signal-hook-registry v1.4.1
   Compiling num_cpus v1.15.0
   Compiling tokio-macros v1.8.2
   Compiling pin-project-internal v1.0.12
   Compiling async-trait v0.1.64
   Compiling pin-project v1.0.12
   Compiling tor-error v0.4.1 (/home/pbulk/build/net/arti/work/arti-arti-v1.1.2/crates/tor-error)
   Compiling openssl-sys v0.9.80
   Compiling dirs-sys v0.3.7
   Compiling indexmap v1.9.2
   Compiling derive_builder_core_fork_arti v0.11.2
   Compiling atomic v0.5.1
   Compiling void v1.0.2
   Compiling same-file v1.0.6
   Compiling paste v1.0.11
   Compiling tinyvec_macros v0.1.1
   Compiling crossbeam-queue v0.3.8
   Compiling tinyvec v1.6.0
   Compiling walkdir v2.3.2
   Compiling derive_builder_macro_fork_arti v0.11.2
   Compiling dirs v4.0.0
   Compiling humantime v2.1.0
   Compiling caret v0.3.1 (/home/pbulk/build/net/arti/work/arti-arti-v1.1.2/crates/caret)
   Compiling semver v1.0.16
   Compiling derive_builder_fork_arti v0.11.2
   Compiling unicode-normalization v0.1.22
   Compiling tor-bytes v0.6.2 (/home/pbulk/build/net/arti/work/arti-arti-v1.1.2/crates/tor-bytes)
   Compiling serde_spanned v0.6.1
   Compiling toml_datetime v0.6.1
   Compiling users v0.11.0
error[E0433]: failed to resolve: could not find `UserExtras` in `os`
  --> /home/pbulk/build/net/arti/work/vendor/users-0.11.0/src/base.rs:78:26
   |
78 |         let extras = os::UserExtras::default();
   |                          ^^^^^^^^^^ could not find `UserExtras` in `os`

error[E0433]: failed to resolve: could not find `GroupExtras` in `os`
   --> /home/pbulk/build/net/arti/work/vendor/users-0.11.0/src/base.rs:192:26
    |
192 |         let extras = os::GroupExtras::default();
    |                          ^^^^^^^^^^^ could not find `GroupExtras` in `os`

error[E0433]: failed to resolve: could not find `UserExtras` in `os`
   --> /home/pbulk/build/net/arti/work/vendor/users-0.11.0/src/base.rs:266:28
    |
266 |         extras:        os::UserExtras::from_passwd(passwd),
    |                            ^^^^^^^^^^ could not find `UserExtras` in `os`

error[E0433]: failed to resolve: could not find `GroupExtras` in `os`
   --> /home/pbulk/build/net/arti/work/vendor/users-0.11.0/src/base.rs:280:23
    |
280 |         extras:   os::GroupExtras::from_struct(group),
    |                       ^^^^^^^^^^^ could not find `GroupExtras` in `os`

error[E0412]: cannot find type `UserExtras` in module `os`
  --> /home/pbulk/build/net/arti/work/vendor/users-0.11.0/src/base.rs:57:17
   |
57 |     extras: os::UserExtras,
   |                 ^^^^^^^^^^ not found in `os`

error[E0412]: cannot find type `GroupExtras` in module `os`
   --> /home/pbulk/build/net/arti/work/vendor/users-0.11.0/src/base.rs:171:17
    |
171 |     extras: os::GroupExtras,
    |                 ^^^^^^^^^^^ not found in `os`

Some errors have detailed explanations: E0412, E0433.
For more information about an error, try `rustc --explain E0412`.
error: could not compile `users` due to 6 previous errors
*** Error code 101

Stop.
bmake[1]: stopped in /data/jenkins/workspace/pkgsrc-upstream-trunk/net/arti
*** Error code 1

Stop.
bmake: stopped in /data/jenkins/workspace/pkgsrc-upstream-trunk/net/arti