+ case "${usergroup_phase}" in
+ local run_cmd
+ run_cmd=run_su
+ shift
+ run_su /opt/pkg/bin/bmake all BATCH=1 DEPENDS_TARGET=/nonexistent WRKLOG=/tmp/bulklog/afterstep-2.2.12nb1/work.log
+ su pbulk -c '"$@"' make /opt/pkg/bin/bmake all BATCH=1 DEPENDS_TARGET=/nonexistent WRKLOG=/tmp/bulklog/afterstep-2.2.12nb1/work.log
=> Bootstrap dependency digest>=20211023: found digest-20220214
===> Building for afterstep-2.2.12nb1
gmake[1]: Entering directory '/home/pbulk/build/wm/afterstep/work/afterstep-devel-2.2.12/libAfterBase'
Compiling with :gcc -O3 -DNO_DEBUG_OUTPUT -pipe -fno-aggressive-loop-optimizations -pipe -fno-aggressive-loop-optimizations -D_FORTIFY_SOURCE=2 -I/opt/pkg/include -I/opt/pkg/include/libdrm -I/usr/include -I/opt/pkg/include/freetype2 -I/opt/pkg/include/glib-2.0 -I/opt/pkg/include/gio-unix-2.0 -I/opt/pkg/lib/glib-2.0/include -I/opt/pkg/include/harfbuzz -fPIC    
 ashash.c
In file included from ashash.c:35:
output.h:59:13: warning: inline function 'nonGNUC_debugout_stub' declared but never defined
   59 | inline void nonGNUC_debugout_stub( const char *format, ...);
      |             ^~~~~~~~~~~~~~~~~~~~~
 aslist.c
In file included from aslist.c:28:
output.h:59:13: warning: inline function 'nonGNUC_debugout_stub' declared but never defined
   59 | inline void nonGNUC_debugout_stub( const char *format, ...);
      |             ^~~~~~~~~~~~~~~~~~~~~
 asvector.c
In file included from asvector.c:28:
output.h:59:13: warning: inline function 'nonGNUC_debugout_stub' declared but never defined
   59 | inline void nonGNUC_debugout_stub( const char *format, ...);
      |             ^~~~~~~~~~~~~~~~~~~~~
 audit.c
In file included from audit.c:31:
output.h:59:13: warning: inline function 'nonGNUC_debugout_stub' declared but never defined
   59 | inline void nonGNUC_debugout_stub( const char *format, ...);
      |             ^~~~~~~~~~~~~~~~~~~~~
 fs.c
In file included from fs.c:67:
output.h:59:13: warning: inline function 'nonGNUC_debugout_stub' declared but never defined
   59 | inline void nonGNUC_debugout_stub( const char *format, ...);
      |             ^~~~~~~~~~~~~~~~~~~~~
 layout.c
In file included from layout.c:30:
output.h:59:13: warning: inline function 'nonGNUC_debugout_stub' declared but never defined
   59 | inline void nonGNUC_debugout_stub( const char *format, ...);
      |             ^~~~~~~~~~~~~~~~~~~~~
 mystring.c
In file included from mystring.c:28:
output.h:59:13: warning: inline function 'nonGNUC_debugout_stub' declared but never defined
   59 | inline void nonGNUC_debugout_stub( const char *format, ...);
      |             ^~~~~~~~~~~~~~~~~~~~~
 os.c
In file included from os.c:27:
output.h:59:13: warning: inline function 'nonGNUC_debugout_stub' declared but never defined
   59 | inline void nonGNUC_debugout_stub( const char *format, ...);
      |             ^~~~~~~~~~~~~~~~~~~~~
 output.c
 parse.c
In file included from parse.c:47:
output.h:59:13: warning: inline function 'nonGNUC_debugout_stub' declared but never defined
   59 | inline void nonGNUC_debugout_stub( const char *format, ...);
      |             ^~~~~~~~~~~~~~~~~~~~~
 regexp.c
 safemalloc.c
In file included from safemalloc.c:34:
output.h:59:13: warning: inline function 'nonGNUC_debugout_stub' declared but never defined
   59 | inline void nonGNUC_debugout_stub( const char *format, ...);
      |             ^~~~~~~~~~~~~~~~~~~~~
 selfdiag.c
In file included from selfdiag.c:35:
output.h:59:13: warning: inline function 'nonGNUC_debugout_stub' declared but never defined
   59 | inline void nonGNUC_debugout_stub( const char *format, ...);
      |             ^~~~~~~~~~~~~~~~~~~~~
 sleep.c
 socket.c
In file included from socket.c:50:
output.h:59:13: warning: inline function 'nonGNUC_debugout_stub' declared but never defined
   59 | inline void nonGNUC_debugout_stub( const char *format, ...);
      |             ^~~~~~~~~~~~~~~~~~~~~
 timer.c
In file included from timer.c:37:
output.h:59:13: warning: inline function 'nonGNUC_debugout_stub' declared but never defined
   59 | inline void nonGNUC_debugout_stub( const char *format, ...);
      |             ^~~~~~~~~~~~~~~~~~~~~
 trace.c
 xml.c
In file included from xml.c:40:
output.h:59:13: warning: inline function 'nonGNUC_debugout_stub' declared but never defined
   59 | inline void nonGNUC_debugout_stub( const char *format, ...);
      |             ^~~~~~~~~~~~~~~~~~~~~
 xprop.c
In file included from xprop.c:40:
output.h:59:13: warning: inline function 'nonGNUC_debugout_stub' declared but never defined
   59 | inline void nonGNUC_debugout_stub( const char *format, ...);
      |             ^~~~~~~~~~~~~~~~~~~~~
 xwrap.c
In file included from xwrap.c:25:
output.h:59:13: warning: inline function 'nonGNUC_debugout_stub' declared but never defined
   59 | inline void nonGNUC_debugout_stub( const char *format, ...);
      |             ^~~~~~~~~~~~~~~~~~~~~
/usr/bin/rm -f libAfterBase.a
ar clq libAfterBase.a ashash.o aslist.o asvector.o audit.o fs.o layout.o mystring.o os.o output.o parse.o regexp.o safemalloc.o selfdiag.o sleep.o socket.o timer.o trace.o xml.o xprop.o xwrap.o
ranlib libAfterBase.a
gmake[1]: Leaving directory '/home/pbulk/build/wm/afterstep/work/afterstep-devel-2.2.12/libAfterBase'
gmake[1]: Entering directory '/home/pbulk/build/wm/afterstep/work/afterstep-devel-2.2.12/libAfterImage'
Makefile:378: warning: ignoring prerequisites on suffix rule definition
 asimage.c
In file included from afterbase.h:23,
                 from asimage.c:62:
../libAfterBase/output.h:59:13: warning: inline function 'nonGNUC_debugout_stub' declared but never defined
   59 | inline void nonGNUC_debugout_stub( const char *format, ...);
      |             ^~~~~~~~~~~~~~~~~~~~~
 ascmap.c
In file included from afterbase.h:23,
                 from ascmap.c:56:
../libAfterBase/output.h:59:13: warning: inline function 'nonGNUC_debugout_stub' declared but never defined
   59 | inline void nonGNUC_debugout_stub( const char *format, ...);
      |             ^~~~~~~~~~~~~~~~~~~~~
 asfont.c
In file included from afterbase.h:23,
                 from asfont.c:81:
../libAfterBase/output.h:59:13: warning: inline function 'nonGNUC_debugout_stub' declared but never defined
   59 | inline void nonGNUC_debugout_stub( const char *format, ...);
      |             ^~~~~~~~~~~~~~~~~~~~~
 asimagexml.c
In file included from afterbase.h:23,
                 from asimagexml.c:58:
../libAfterBase/output.h:59:13: warning: inline function 'nonGNUC_debugout_stub' declared but never defined
   59 | inline void nonGNUC_debugout_stub( const char *format, ...);
      |             ^~~~~~~~~~~~~~~~~~~~~
 asstorage.c
In file included from afterbase.h:23,
                 from asstorage.c:63:
../libAfterBase/output.h:59:13: warning: inline function 'nonGNUC_debugout_stub' declared but never defined
   59 | inline void nonGNUC_debugout_stub( const char *format, ...);
      |             ^~~~~~~~~~~~~~~~~~~~~
 asvisual.c
In file included from afterbase.h:23,
                 from asvisual.c:41:
../libAfterBase/output.h:59:13: warning: inline function 'nonGNUC_debugout_stub' declared but never defined
   59 | inline void nonGNUC_debugout_stub( const char *format, ...);
      |             ^~~~~~~~~~~~~~~~~~~~~
 blender.c
In file included from afterbase.h:23,
                 from blender.c:36:
../libAfterBase/output.h:59:13: warning: inline function 'nonGNUC_debugout_stub' declared but never defined
   59 | inline void nonGNUC_debugout_stub( const char *format, ...);
      |             ^~~~~~~~~~~~~~~~~~~~~
 bmp.c
In file included from afterbase.h:23,
                 from bmp.c:32:
../libAfterBase/output.h:59:13: warning: inline function 'nonGNUC_debugout_stub' declared but never defined
   59 | inline void nonGNUC_debugout_stub( const char *format, ...);
      |             ^~~~~~~~~~~~~~~~~~~~~
 char2uni.c
In file included from afterbase.h:23,
                 from char2uni.c:43:
../libAfterBase/output.h:59:13: warning: inline function 'nonGNUC_debugout_stub' declared but never defined
   59 | inline void nonGNUC_debugout_stub( const char *format, ...);
      |             ^~~~~~~~~~~~~~~~~~~~~
 draw.c
In file included from afterbase.h:23,
                 from draw.c:44:
../libAfterBase/output.h:59:13: warning: inline function 'nonGNUC_debugout_stub' declared but never defined
   59 | inline void nonGNUC_debugout_stub( const char *format, ...);
      |             ^~~~~~~~~~~~~~~~~~~~~
 export.c
export.c: In function 'ASImage2tiff':
export.c:1149:2: warning: 'uint16' is deprecated [-Wdeprecated-declarations]
 1149 |  uint16 photometric = PHOTOMETRIC_RGB;
      |  ^~~~~~
export.c:1195:2: warning: 'uint32' is deprecated [-Wdeprecated-declarations]
 1195 |  TIFFSetField(out, TIFFTAG_IMAGEWIDTH, (uint32) im->width);
      |  ^~~~~~~~~~~~
export.c:1196:2: warning: 'uint32' is deprecated [-Wdeprecated-declarations]
 1196 |  TIFFSetField(out, TIFFTAG_IMAGELENGTH, (uint32) im->height);
      |  ^~~~~~~~~~~~
export.c:1201:6: warning: 'uint16' is deprecated [-Wdeprecated-declarations]
 1201 |      uint16 v[1];
      |      ^~~~~~
In file included from afterbase.h:23,
                 from export.c:84:
export.c: At top level:
../libAfterBase/output.h:59:13: warning: inline function 'nonGNUC_debugout_stub' declared but never defined
   59 | inline void nonGNUC_debugout_stub( const char *format, ...);
      |             ^~~~~~~~~~~~~~~~~~~~~
 imencdec.c
In file included from afterbase.h:23,
                 from imencdec.c:64:
../libAfterBase/output.h:59:13: warning: inline function 'nonGNUC_debugout_stub' declared but never defined
   59 | inline void nonGNUC_debugout_stub( const char *format, ...);
      |             ^~~~~~~~~~~~~~~~~~~~~
 import.c
import.c: In function 'tiff2ASImage':
import.c:2315:7: warning: 'uint32' is deprecated [-Wdeprecated-declarations]
 2315 |       uint32* bc;
      |       ^~~~~~
In file included from afterbase.h:23,
                 from import.c:92:
import.c: At top level:
../libAfterBase/output.h:59:13: warning: inline function 'nonGNUC_debugout_stub' declared but never defined
   59 | inline void nonGNUC_debugout_stub( const char *format, ...);
      |             ^~~~~~~~~~~~~~~~~~~~~
 pixmap.c
In file included from afterbase.h:23,
                 from pixmap.c:61:
../libAfterBase/output.h:59:13: warning: inline function 'nonGNUC_debugout_stub' declared but never defined
   59 | inline void nonGNUC_debugout_stub( const char *format, ...);
      |             ^~~~~~~~~~~~~~~~~~~~~
 scanline.c
In file included from afterbase.h:23,
                 from scanline.c:40:
../libAfterBase/output.h:59:13: warning: inline function 'nonGNUC_debugout_stub' declared but never defined
   59 | inline void nonGNUC_debugout_stub( const char *format, ...);
      |             ^~~~~~~~~~~~~~~~~~~~~
 transform.c
In file included from afterbase.h:23,
                 from transform.c:64:
../libAfterBase/output.h:59:13: warning: inline function 'nonGNUC_debugout_stub' declared but never defined
   59 | inline void nonGNUC_debugout_stub( const char *format, ...);
      |             ^~~~~~~~~~~~~~~~~~~~~
transform.c: In function 'blur_asimage_gauss':
transform.c:2092:1: warning: inlining failed in call to 'gauss_component_int': --param max-inline-insns-single limit reached [-Winline]
 2092 | gauss_component_int(gauss_data_t *s1, gauss_data_t *d1, int radius, GAUSS_COEFF_TYPE* gauss, GAUSS_COEFF_TYPE* gauss_sums, int len)
      | ^~~~~~~~~~~~~~~~~~~
transform.c:2300:5: note: called from here
 2300 |     gauss_component_int(src_chan, res_chan, horz, sgauss, sgauss_sums, result->width);
      |     ^~~~~~~~~~~~~~~~~~~~~~~~~~~~~~~~~~~~~~~~~~~~~~~~~~~~~~~~~~~~~~~~~~~~~~~~~~~~~~~~~
transform.c:2092:1: warning: inlining failed in call to 'gauss_component_int': --param max-inline-insns-single limit reached [-Winline]
 2092 | gauss_component_int(gauss_data_t *s1, gauss_data_t *d1, int radius, GAUSS_COEFF_TYPE* gauss, GAUSS_COEFF_TYPE* gauss_sums, int len)
      | ^~~~~~~~~~~~~~~~~~~
transform.c:2300:5: note: called from here
 2300 |     gauss_component_int(src_chan, res_chan, horz, sgauss, sgauss_sums, result->width);
      |     ^~~~~~~~~~~~~~~~~~~~~~~~~~~~~~~~~~~~~~~~~~~~~~~~~~~~~~~~~~~~~~~~~~~~~~~~~~~~~~~~~
transform.c:2092:1: warning: inlining failed in call to 'gauss_component_int': --param max-inline-insns-single limit reached [-Winline]
 2092 | gauss_component_int(gauss_data_t *s1, gauss_data_t *d1, int radius, GAUSS_COEFF_TYPE* gauss, GAUSS_COEFF_TYPE* gauss_sums, int len)
      | ^~~~~~~~~~~~~~~~~~~
transform.c:2300:5: note: called from here
 2300 |     gauss_component_int(src_chan, res_chan, horz, sgauss, sgauss_sums, result->width);
      |     ^~~~~~~~~~~~~~~~~~~~~~~~~~~~~~~~~~~~~~~~~~~~~~~~~~~~~~~~~~~~~~~~~~~~~~~~~~~~~~~~~
 ungif.c
In file included from afterbase.h:23,
                 from ungif.c:56:
../libAfterBase/output.h:59:13: warning: inline function 'nonGNUC_debugout_stub' declared but never defined
   59 | inline void nonGNUC_debugout_stub( const char *format, ...);
      |             ^~~~~~~~~~~~~~~~~~~~~
 xcf.c
In file included from afterbase.h:23,
                 from xcf.c:48:
../libAfterBase/output.h:59:13: warning: inline function 'nonGNUC_debugout_stub' declared but never defined
   59 | inline void nonGNUC_debugout_stub( const char *format, ...);
      |             ^~~~~~~~~~~~~~~~~~~~~
 ximage.c
In file included from afterbase.h:23,
                 from ximage.c:54:
../libAfterBase/output.h:59:13: warning: inline function 'nonGNUC_debugout_stub' declared but never defined
   59 | inline void nonGNUC_debugout_stub( const char *format, ...);
      |             ^~~~~~~~~~~~~~~~~~~~~
 xpm.c
In file included from afterbase.h:23,
                 from xpm.c:72:
../libAfterBase/output.h:59:13: warning: inline function 'nonGNUC_debugout_stub' declared but never defined
   59 | inline void nonGNUC_debugout_stub( const char *format, ...);
      |             ^~~~~~~~~~~~~~~~~~~~~
Compiled with :gcc -O3 -DNO_DEBUG_OUTPUT -pipe -fno-aggressive-loop-optimizations -pipe -fno-aggressive-loop-optimizations -D_FORTIFY_SOURCE=2 -I/opt/pkg/include -I/opt/pkg/include/libdrm -I/usr/include -I/opt/pkg/include/freetype2 -I/opt/pkg/include/glib-2.0 -I/opt/pkg/include/gio-unix-2.0 -I/opt/pkg/lib/glib-2.0/include -I/opt/pkg/include/harfbuzz -fPIC  -mmmx -Winline --param inline-unit-growth=10000 --param large-function-growth=10000  -I/opt/pkg/include/freetype2 -I/opt/pkg/include -I/opt/pkg/include/libpng16   
Compiling with :gcc -O3 -DNO_DEBUG_OUTPUT -pipe -fno-aggressive-loop-optimizations -pipe -fno-aggressive-loop-optimizations -D_FORTIFY_SOURCE=2 -I/opt/pkg/include -I/opt/pkg/include/libdrm -I/usr/include -I/opt/pkg/include/freetype2 -I/opt/pkg/include/glib-2.0 -I/opt/pkg/include/gio-unix-2.0 -I/opt/pkg/lib/glib-2.0/include -I/opt/pkg/include/harfbuzz -fPIC  -mmmx -Winline --param inline-unit-growth=10000 --param large-function-growth=10000  -I/opt/pkg/include/freetype2 -I/opt/pkg/include -I/opt/pkg/include/libpng16   
/usr/bin/rm -f libAfterImage.a
ar clq libAfterImage.a asimage.o ascmap.o asfont.o asimagexml.o asstorage.o asvisual.o blender.o bmp.o char2uni.o draw.o export.o imencdec.o import.o pixmap.o scanline.o transform.o ungif.o xcf.o ximage.o xpm.o
ranlib libAfterImage.a
gmake[2]: Entering directory '/home/pbulk/build/wm/afterstep/work/afterstep-devel-2.2.12/libAfterImage/apps'
Makefile:174: warning: ignoring prerequisites on suffix rule definition
 asview
In file included from ../afterbase.h:23,
                 from asview.c:20:
../../libAfterBase/output.h:59:13: warning: inline function 'nonGNUC_debugout_stub' declared but never defined
   59 | inline void nonGNUC_debugout_stub( const char *format, ...);
      |             ^~~~~~~~~~~~~~~~~~~~~
 common
In file included from ../afterbase.h:23,
                 from common.c:5:
../../libAfterBase/output.h:59:13: warning: inline function 'nonGNUC_debugout_stub' declared but never defined
   59 | inline void nonGNUC_debugout_stub( const char *format, ...);
      |             ^~~~~~~~~~~~~~~~~~~~~
 asscale
In file included from ../afterbase.h:23,
                 from asscale.c:27:
../../libAfterBase/output.h:59:13: warning: inline function 'nonGNUC_debugout_stub' declared but never defined
   59 | inline void nonGNUC_debugout_stub( const char *format, ...);
      |             ^~~~~~~~~~~~~~~~~~~~~
 astile
In file included from ../afterbase.h:23,
                 from astile.c:44:
../../libAfterBase/output.h:59:13: warning: inline function 'nonGNUC_debugout_stub' declared but never defined
   59 | inline void nonGNUC_debugout_stub( const char *format, ...);
      |             ^~~~~~~~~~~~~~~~~~~~~
 asmerge
In file included from ../afterbase.h:23,
                 from asmerge.c:34:
../../libAfterBase/output.h:59:13: warning: inline function 'nonGNUC_debugout_stub' declared but never defined
   59 | inline void nonGNUC_debugout_stub( const char *format, ...);
      |             ^~~~~~~~~~~~~~~~~~~~~
 asgrad
In file included from ../afterbase.h:23,
                 from asgrad.c:26:
../../libAfterBase/output.h:59:13: warning: inline function 'nonGNUC_debugout_stub' declared but never defined
   59 | inline void nonGNUC_debugout_stub( const char *format, ...);
      |             ^~~~~~~~~~~~~~~~~~~~~
 asflip
In file included from ../afterbase.h:23,
                 from asflip.c:26:
../../libAfterBase/output.h:59:13: warning: inline function 'nonGNUC_debugout_stub' declared but never defined
   59 | inline void nonGNUC_debugout_stub( const char *format, ...);
      |             ^~~~~~~~~~~~~~~~~~~~~
 asi18n
In file included from ../afterbase.h:23,
                 from asi18n.c:8:
../../libAfterBase/output.h:59:13: warning: inline function 'nonGNUC_debugout_stub' declared but never defined
   59 | inline void nonGNUC_debugout_stub( const char *format, ...);
      |             ^~~~~~~~~~~~~~~~~~~~~
 astext
In file included from ../afterbase.h:23,
                 from astext.c:34:
../../libAfterBase/output.h:59:13: warning: inline function 'nonGNUC_debugout_stub' declared but never defined
   59 | inline void nonGNUC_debugout_stub( const char *format, ...);
      |             ^~~~~~~~~~~~~~~~~~~~~
 ascompose
In file included from ../afterbase.h:23,
                 from ascompose.c:47:
../../libAfterBase/output.h:59:13: warning: inline function 'nonGNUC_debugout_stub' declared but never defined
   59 | inline void nonGNUC_debugout_stub( const char *format, ...);
      |             ^~~~~~~~~~~~~~~~~~~~~
 asvector
In file included from ../afterbase.h:23,
                 from asvector.c:24:
../../libAfterBase/output.h:59:13: warning: inline function 'nonGNUC_debugout_stub' declared but never defined
   59 | inline void nonGNUC_debugout_stub( const char *format, ...);
      |             ^~~~~~~~~~~~~~~~~~~~~
 ascheckttf
In file included from ../afterbase.h:23,
                 from ascheckttf.c:6:
../../libAfterBase/output.h:59:13: warning: inline function 'nonGNUC_debugout_stub' declared but never defined
   59 | inline void nonGNUC_debugout_stub( const char *format, ...);
      |             ^~~~~~~~~~~~~~~~~~~~~
gmake[2]: Leaving directory '/home/pbulk/build/wm/afterstep/work/afterstep-devel-2.2.12/libAfterImage/apps'
gmake[1]: Leaving directory '/home/pbulk/build/wm/afterstep/work/afterstep-devel-2.2.12/libAfterImage'
gmake[1]: Entering directory '/home/pbulk/build/wm/afterstep/work/afterstep-devel-2.2.12/libAfterStep'
Compiling with :gcc -DNO_DEBUG_OUTPUT -pipe -fno-aggressive-loop-optimizations -pipe -fno-aggressive-loop-optimizations -D_FORTIFY_SOURCE=2 -I/opt/pkg/include -I/opt/pkg/include/libdrm -I/usr/include -I/opt/pkg/include/freetype2 -I/opt/pkg/include/glib-2.0 -I/opt/pkg/include/gio-unix-2.0 -I/opt/pkg/lib/glib-2.0/include -I/opt/pkg/include/harfbuzz -fPIC    
 asapp.c
In file included from asapp.c:35:
session.h:52:20: warning: inline function 'get_session_override' declared but never defined
   52 | inline const char *get_session_override(ASSession * session, int function );
      |                    ^~~~~~~~~~~~~~~~~~~~
In file included from screen.h:15,
                 from asapp.c:33:
mylook.h:400:25: warning: inline function 'add_deskconfig_to_list' declared but never defined
  400 | inline MyDesktopConfig *add_deskconfig_to_list( ASHashTable *list, MyDesktopConfig *dc );
      |                         ^~~~~~~~~~~~~~~~~~~~~~
In file included from ../include/afterbase.h:2,
                 from asapp.h:45,
                 from asapp.c:30:
../include/../libAfterBase/output.h:59:13: warning: inline function 'nonGNUC_debugout_stub' declared but never defined
   59 | inline void nonGNUC_debugout_stub( const char *format, ...);
      |             ^~~~~~~~~~~~~~~~~~~~~
 ascommand.c
In file included from screen.h:15,
                 from ascommand.c:36:
mylook.h:400:25: warning: inline function 'add_deskconfig_to_list' declared but never defined
  400 | inline MyDesktopConfig *add_deskconfig_to_list( ASHashTable *list, MyDesktopConfig *dc );
      |                         ^~~~~~~~~~~~~~~~~~~~~~
In file included from ../include/afterbase.h:2,
                 from asapp.h:45,
                 from ascommand.c:23:
../include/../libAfterBase/output.h:59:13: warning: inline function 'nonGNUC_debugout_stub' declared but never defined
   59 | inline void nonGNUC_debugout_stub( const char *format, ...);
      |             ^~~~~~~~~~~~~~~~~~~~~
 asdatabase.c
In file included from ../include/afterbase.h:2,
                 from asapp.h:45,
                 from asdatabase.c:29:
../include/../libAfterBase/output.h:59:13: warning: inline function 'nonGNUC_debugout_stub' declared but never defined
   59 | inline void nonGNUC_debugout_stub( const char *format, ...);
      |             ^~~~~~~~~~~~~~~~~~~~~
 asfeel.c
In file included from screen.h:15,
                 from asfeel.c:28:
mylook.h:400:25: warning: inline function 'add_deskconfig_to_list' declared but never defined
  400 | inline MyDesktopConfig *add_deskconfig_to_list( ASHashTable *list, MyDesktopConfig *dc );
      |                         ^~~~~~~~~~~~~~~~~~~~~~
In file included from ../include/afterbase.h:2,
                 from asapp.h:45,
                 from asfeel.c:23:
../include/../libAfterBase/output.h:59:13: warning: inline function 'nonGNUC_debugout_stub' declared but never defined
   59 | inline void nonGNUC_debugout_stub( const char *format, ...);
      |             ^~~~~~~~~~~~~~~~~~~~~
 aswindata.c
In file included from screen.h:15,
                 from aswindata.c:28:
mylook.h:400:25: warning: inline function 'add_deskconfig_to_list' declared but never defined
  400 | inline MyDesktopConfig *add_deskconfig_to_list( ASHashTable *list, MyDesktopConfig *dc );
      |                         ^~~~~~~~~~~~~~~~~~~~~~
In file included from ../include/afterbase.h:2,
                 from asapp.h:45,
                 from aswindata.c:26:
../include/../libAfterBase/output.h:59:13: warning: inline function 'nonGNUC_debugout_stub' declared but never defined
   59 | inline void nonGNUC_debugout_stub( const char *format, ...);
      |             ^~~~~~~~~~~~~~~~~~~~~
 balloon.c
In file included from screen.h:15,
                 from balloon.c:29:
mylook.h:400:25: warning: inline function 'add_deskconfig_to_list' declared but never defined
  400 | inline MyDesktopConfig *add_deskconfig_to_list( ASHashTable *list, MyDesktopConfig *dc );
      |                         ^~~~~~~~~~~~~~~~~~~~~~
In file included from ../include/afterbase.h:2,
                 from asapp.h:45,
                 from balloon.c:26:
../include/../libAfterBase/output.h:59:13: warning: inline function 'nonGNUC_debugout_stub' declared but never defined
   59 | inline void nonGNUC_debugout_stub( const char *format, ...);
      |             ^~~~~~~~~~~~~~~~~~~~~
 canvas.c
In file included from screen.h:15,
                 from canvas.c:29:
mylook.h:400:25: warning: inline function 'add_deskconfig_to_list' declared but never defined
  400 | inline MyDesktopConfig *add_deskconfig_to_list( ASHashTable *list, MyDesktopConfig *dc );
      |                         ^~~~~~~~~~~~~~~~~~~~~~
In file included from ../include/afterbase.h:2,
                 from asapp.h:45,
                 from canvas.c:27:
../include/../libAfterBase/output.h:59:13: warning: inline function 'nonGNUC_debugout_stub' declared but never defined
   59 | inline void nonGNUC_debugout_stub( const char *format, ...);
      |             ^~~~~~~~~~~~~~~~~~~~~
 clientprops.c
In file included from screen.h:15,
                 from clientprops.c:23:
mylook.h:400:25: warning: inline function 'add_deskconfig_to_list' declared but never defined
  400 | inline MyDesktopConfig *add_deskconfig_to_list( ASHashTable *list, MyDesktopConfig *dc );
      |                         ^~~~~~~~~~~~~~~~~~~~~~
In file included from ../include/afterbase.h:2,
                 from asapp.h:45,
                 from clientprops.c:22:
../include/../libAfterBase/output.h:59:13: warning: inline function 'nonGNUC_debugout_stub' declared but never defined
   59 | inline void nonGNUC_debugout_stub( const char *format, ...);
      |             ^~~~~~~~~~~~~~~~~~~~~
 colorscheme.c
colorscheme.c:182:12: warning: 'MAKE_ARGB32_SHADE100' is static but used in inline function 'make_mono_grad_argb' which is not static
  182 |  grad[1] = MAKE_ARGB32_SHADE100 (base_alpha16, light_val);
      |            ^~~~~~~~~~~~~~~~~~~~
colorscheme.c:181:12: warning: 'MAKE_ARGB32_SHADE100' is static but used in inline function 'make_mono_grad_argb' which is not static
  181 |  grad[0] = MAKE_ARGB32_SHADE100 (base_alpha16, dark_val);
      |            ^~~~~~~~~~~~~~~~~~~~
In file included from ../include/afterbase.h:2,
                 from asapp.h:45,
                 from colorscheme.c:5:
../include/../libAfterBase/output.h:59:13: warning: inline function 'nonGNUC_debugout_stub' declared but never defined
   59 | inline void nonGNUC_debugout_stub( const char *format, ...);
      |             ^~~~~~~~~~~~~~~~~~~~~
 decor.c
In file included from screen.h:15,
                 from decor.c:26:
mylook.h:400:25: warning: inline function 'add_deskconfig_to_list' declared but never defined
  400 | inline MyDesktopConfig *add_deskconfig_to_list( ASHashTable *list, MyDesktopConfig *dc );
      |                         ^~~~~~~~~~~~~~~~~~~~~~
In file included from ../include/afterbase.h:2,
                 from asapp.h:45,
                 from decor.c:23:
../include/../libAfterBase/output.h:59:13: warning: inline function 'nonGNUC_debugout_stub' declared but never defined
   59 | inline void nonGNUC_debugout_stub( const char *format, ...);
      |             ^~~~~~~~~~~~~~~~~~~~~
 desktop_category.c
In file included from ../include/afterbase.h:2,
                 from asapp.h:45,
                 from desktop_category.c:26:
../include/../libAfterBase/output.h:59:13: warning: inline function 'nonGNUC_debugout_stub' declared but never defined
   59 | inline void nonGNUC_debugout_stub( const char *format, ...);
      |             ^~~~~~~~~~~~~~~~~~~~~
 event.c
event.c:237:12: warning: '_as_event_types' is static but used in inline function 'stash_event_time' which is not static
  237 |    return (_as_event_types[xevent->type].last_time = *ptime);
      |            ^~~~~~~~~~~~~~~
event.c:220:20: warning: 'last_system_time' is static but declared in inline function 'stash_event_time' which is not static
  220 |      static time_t last_system_time = 0;
      |                    ^~~~~~~~~~~~~~~~
event.c:219:9: warning: 'as_xserver_is_local' is static but used in inline function 'stash_event_time' which is not static
  219 |     if (as_xserver_is_local) { /* hack to detect local time change and try to work around it */
      |         ^~~~~~~~~~~~~~~~~~~
event.c:210:10: warning: '_as_event_types' is static but used in inline function 'stash_event_time' which is not static
  210 |          _as_event_types[xevent->type].time_offset);
      |          ^~~~~~~~~~~~~~~
In file included from screen.h:15,
                 from event.c:24:
mylook.h:400:25: warning: inline function 'add_deskconfig_to_list' declared but never defined
  400 | inline MyDesktopConfig *add_deskconfig_to_list( ASHashTable *list, MyDesktopConfig *dc );
      |                         ^~~~~~~~~~~~~~~~~~~~~~
In file included from ../include/afterbase.h:2,
                 from asapp.h:45,
                 from event.c:21:
../include/../libAfterBase/output.h:59:13: warning: inline function 'nonGNUC_debugout_stub' declared but never defined
   59 | inline void nonGNUC_debugout_stub( const char *format, ...);
      |             ^~~~~~~~~~~~~~~~~~~~~
 freestor.c
In file included from screen.h:15,
                 from freestor.c:48:
mylook.h:400:25: warning: inline function 'add_deskconfig_to_list' declared but never defined
  400 | inline MyDesktopConfig *add_deskconfig_to_list( ASHashTable *list, MyDesktopConfig *dc );
      |                         ^~~~~~~~~~~~~~~~~~~~~~
In file included from ../include/afterbase.h:2,
                 from asapp.h:45,
                 from freestor.c:45:
../include/../libAfterBase/output.h:59:13: warning: inline function 'nonGNUC_debugout_stub' declared but never defined
   59 | inline void nonGNUC_debugout_stub( const char *format, ...);
      |             ^~~~~~~~~~~~~~~~~~~~~
 functions.c
In file included from screen.h:15,
                 from functions.c:28:
mylook.h:400:25: warning: inline function 'add_deskconfig_to_list' declared but never defined
  400 | inline MyDesktopConfig *add_deskconfig_to_list( ASHashTable *list, MyDesktopConfig *dc );
      |                         ^~~~~~~~~~~~~~~~~~~~~~
In file included from functions.c:26:
session.h:52:20: warning: inline function 'get_session_override' declared but never defined
   52 | inline const char *get_session_override(ASSession * session, int function );
      |                    ^~~~~~~~~~~~~~~~~~~~
In file included from ../include/afterbase.h:2,
                 from asapp.h:45,
                 from functions.c:25:
../include/../libAfterBase/output.h:59:13: warning: inline function 'nonGNUC_debugout_stub' declared but never defined
   59 | inline void nonGNUC_debugout_stub( const char *format, ...);
      |             ^~~~~~~~~~~~~~~~~~~~~
 font.c
In file included from screen.h:15,
                 from font.c:3:
mylook.h:400:25: warning: inline function 'add_deskconfig_to_list' declared but never defined
  400 | inline MyDesktopConfig *add_deskconfig_to_list( ASHashTable *list, MyDesktopConfig *dc );
      |                         ^~~~~~~~~~~~~~~~~~~~~~
In file included from ../include/afterbase.h:2,
                 from asapp.h:45,
                 from font.c:2:
../include/../libAfterBase/output.h:59:13: warning: inline function 'nonGNUC_debugout_stub' declared but never defined
   59 | inline void nonGNUC_debugout_stub( const char *format, ...);
      |             ^~~~~~~~~~~~~~~~~~~~~
 hints.c
In file included from screen.h:15,
                 from hints.c:26:
mylook.h:400:25: warning: inline function 'add_deskconfig_to_list' declared but never defined
  400 | inline MyDesktopConfig *add_deskconfig_to_list( ASHashTable *list, MyDesktopConfig *dc );
      |                         ^~~~~~~~~~~~~~~~~~~~~~
In file included from ../include/afterbase.h:2,
                 from asapp.h:45,
                 from hints.c:23:
../include/../libAfterBase/output.h:59:13: warning: inline function 'nonGNUC_debugout_stub' declared but never defined
   59 | inline void nonGNUC_debugout_stub( const char *format, ...);
      |             ^~~~~~~~~~~~~~~~~~~~~
 kde.c
In file included from ../include/afterbase.h:2,
                 from asapp.h:45,
                 from kde.c:24:
../include/../libAfterBase/output.h:59:13: warning: inline function 'nonGNUC_debugout_stub' declared but never defined
   59 | inline void nonGNUC_debugout_stub( const char *format, ...);
      |             ^~~~~~~~~~~~~~~~~~~~~
 module.c
In file included from module.c:44:
session.h:52:20: warning: inline function 'get_session_override' declared but never defined
   52 | inline const char *get_session_override(ASSession * session, int function );
      |                    ^~~~~~~~~~~~~~~~~~~~
In file included from screen.h:15,
                 from module.c:41:
mylook.h:400:25: warning: inline function 'add_deskconfig_to_list' declared but never defined
  400 | inline MyDesktopConfig *add_deskconfig_to_list( ASHashTable *list, MyDesktopConfig *dc );
      |                         ^~~~~~~~~~~~~~~~~~~~~~
In file included from ../include/afterbase.h:2,
                 from asapp.h:45,
                 from module.c:23:
../include/../libAfterBase/output.h:59:13: warning: inline function 'nonGNUC_debugout_stub' declared but never defined
   59 | inline void nonGNUC_debugout_stub( const char *format, ...);
      |             ^~~~~~~~~~~~~~~~~~~~~
 moveresize.c
In file included from screen.h:15,
                 from moveresize.c:33:
mylook.h:400:25: warning: inline function 'add_deskconfig_to_list' declared but never defined
  400 | inline MyDesktopConfig *add_deskconfig_to_list( ASHashTable *list, MyDesktopConfig *dc );
      |                         ^~~~~~~~~~~~~~~~~~~~~~
In file included from ../include/afterbase.h:2,
                 from asapp.h:45,
                 from moveresize.c:27:
../include/../libAfterBase/output.h:59:13: warning: inline function 'nonGNUC_debugout_stub' declared but never defined
   59 | inline void nonGNUC_debugout_stub( const char *format, ...);
      |             ^~~~~~~~~~~~~~~~~~~~~
 myicon.c
In file included from screen.h:15,
                 from myicon.c:28:
mylook.h:400:25: warning: inline function 'add_deskconfig_to_list' declared but never defined
  400 | inline MyDesktopConfig *add_deskconfig_to_list( ASHashTable *list, MyDesktopConfig *dc );
      |                         ^~~~~~~~~~~~~~~~~~~~~~
In file included from ../include/afterbase.h:2,
                 from asapp.h:45,
                 from myicon.c:25:
../include/../libAfterBase/output.h:59:13: warning: inline function 'nonGNUC_debugout_stub' declared but never defined
   59 | inline void nonGNUC_debugout_stub( const char *format, ...);
      |             ^~~~~~~~~~~~~~~~~~~~~
 mylook.c
In file included from ../include/afterbase.h:2,
                 from asapp.h:45,
                 from mylook.c:23:
../include/../libAfterBase/output.h:59:13: warning: inline function 'nonGNUC_debugout_stub' declared but never defined
   59 | inline void nonGNUC_debugout_stub( const char *format, ...);
      |             ^~~~~~~~~~~~~~~~~~~~~
 mystyle.c
In file included from screen.h:15,
                 from mystyle.c:28:
mylook.h:400:25: warning: inline function 'add_deskconfig_to_list' declared but never defined
  400 | inline MyDesktopConfig *add_deskconfig_to_list( ASHashTable *list, MyDesktopConfig *dc );
      |                         ^~~~~~~~~~~~~~~~~~~~~~
In file included from ../include/afterbase.h:2,
                 from asapp.h:45,
                 from mystyle.c:24:
../include/../libAfterBase/output.h:59:13: warning: inline function 'nonGNUC_debugout_stub' declared but never defined
   59 | inline void nonGNUC_debugout_stub( const char *format, ...);
      |             ^~~~~~~~~~~~~~~~~~~~~
 mystyle_property.c
In file included from screen.h:15,
                 from mystyle_property.c:25:
mylook.h:400:25: warning: inline function 'add_deskconfig_to_list' declared but never defined
  400 | inline MyDesktopConfig *add_deskconfig_to_list( ASHashTable *list, MyDesktopConfig *dc );
      |                         ^~~~~~~~~~~~~~~~~~~~~~
In file included from ../include/afterbase.h:2,
                 from asapp.h:45,
                 from mystyle_property.c:24:
../include/../libAfterBase/output.h:59:13: warning: inline function 'nonGNUC_debugout_stub' declared but never defined
   59 | inline void nonGNUC_debugout_stub( const char *format, ...);
      |             ^~~~~~~~~~~~~~~~~~~~~
 outline.c
In file included from screen.h:15,
                 from outline.c:32:
mylook.h:400:25: warning: inline function 'add_deskconfig_to_list' declared but never defined
  400 | inline MyDesktopConfig *add_deskconfig_to_list( ASHashTable *list, MyDesktopConfig *dc );
      |                         ^~~~~~~~~~~~~~~~~~~~~~
In file included from ../include/afterbase.h:2,
                 from asapp.h:45,
                 from outline.c:29:
../include/../libAfterBase/output.h:59:13: warning: inline function 'nonGNUC_debugout_stub' declared but never defined
   59 | inline void nonGNUC_debugout_stub( const char *format, ...);
      |             ^~~~~~~~~~~~~~~~~~~~~
 operations.c
In file included from screen.h:15,
                 from operations.h:10,
                 from operations.c:19:
mylook.h:400:25: warning: inline function 'add_deskconfig_to_list' declared but never defined
  400 | inline MyDesktopConfig *add_deskconfig_to_list( ASHashTable *list, MyDesktopConfig *dc );
      |                         ^~~~~~~~~~~~~~~~~~~~~~
In file included from ../include/afterbase.h:2,
                 from asapp.h:45,
                 from operations.h:5,
                 from operations.c:19:
../include/../libAfterBase/output.h:59:13: warning: inline function 'nonGNUC_debugout_stub' declared but never defined
   59 | inline void nonGNUC_debugout_stub( const char *format, ...);
      |             ^~~~~~~~~~~~~~~~~~~~~
 parser.c
In file included from ../include/afterbase.h:2,
                 from asapp.h:45,
                 from parser.c:48:
../include/../libAfterBase/output.h:59:13: warning: inline function 'nonGNUC_debugout_stub' declared but never defined
   59 | inline void nonGNUC_debugout_stub( const char *format, ...);
      |             ^~~~~~~~~~~~~~~~~~~~~
 parser_fs.c
In file included from ../include/afterbase.h:2,
                 from asapp.h:45,
                 from parser_fs.c:42:
../include/../libAfterBase/output.h:59:13: warning: inline function 'nonGNUC_debugout_stub' declared but never defined
   59 | inline void nonGNUC_debugout_stub( const char *format, ...);
      |             ^~~~~~~~~~~~~~~~~~~~~
 parser_xml.c
In file included from ../include/afterbase.h:2,
                 from asapp.h:45,
                 from parser_xml.c:41:
../include/../libAfterBase/output.h:59:13: warning: inline function 'nonGNUC_debugout_stub' declared but never defined
   59 | inline void nonGNUC_debugout_stub( const char *format, ...);
      |             ^~~~~~~~~~~~~~~~~~~~~
 screen.c
screen.c: In function 'ConnectXDisplay':
screen.c:322:6: warning: implicit declaration of function 'fcntl' [-Wimplicit-function-declaration]
  322 |  if (fcntl (x_fd, F_SETFD, 1) == -1)
      |      ^~~~~
In file included from screen.h:15,
                 from screen.c:32:
screen.c: At top level:
mylook.h:400:25: warning: inline function 'add_deskconfig_to_list' declared but never defined
  400 | inline MyDesktopConfig *add_deskconfig_to_list( ASHashTable *list, MyDesktopConfig *dc );
      |                         ^~~~~~~~~~~~~~~~~~~~~~
In file included from ../include/afterbase.h:2,
                 from asapp.h:45,
                 from screen.c:22:
../include/../libAfterBase/output.h:59:13: warning: inline function 'nonGNUC_debugout_stub' declared but never defined
   59 | inline void nonGNUC_debugout_stub( const char *format, ...);
      |             ^~~~~~~~~~~~~~~~~~~~~
 session.c
In file included from screen.h:15,
                 from session.c:28:
mylook.h:400:25: warning: inline function 'add_deskconfig_to_list' declared but never defined
  400 | inline MyDesktopConfig *add_deskconfig_to_list( ASHashTable *list, MyDesktopConfig *dc );
      |                         ^~~~~~~~~~~~~~~~~~~~~~
In file included from ../include/afterbase.h:2,
                 from asapp.h:45,
                 from session.c:26:
../include/../libAfterBase/output.h:59:13: warning: inline function 'nonGNUC_debugout_stub' declared but never defined
   59 | inline void nonGNUC_debugout_stub( const char *format, ...);
      |             ^~~~~~~~~~~~~~~~~~~~~
 shape.c
In file included from ../include/afterbase.h:2,
                 from asapp.h:45,
                 from shape.c:23:
../include/../libAfterBase/output.h:59:13: warning: inline function 'nonGNUC_debugout_stub' declared but never defined
   59 | inline void nonGNUC_debugout_stub( const char *format, ...);
      |             ^~~~~~~~~~~~~~~~~~~~~
 wmprops.c
In file included from screen.h:15,
                 from wmprops.c:23:
mylook.h:400:25: warning: inline function 'add_deskconfig_to_list' declared but never defined
  400 | inline MyDesktopConfig *add_deskconfig_to_list( ASHashTable *list, MyDesktopConfig *dc );
      |                         ^~~~~~~~~~~~~~~~~~~~~~
In file included from ../include/afterbase.h:2,
                 from asapp.h:45,
                 from wmprops.c:22:
../include/../libAfterBase/output.h:59:13: warning: inline function 'nonGNUC_debugout_stub' declared but never defined
   59 | inline void nonGNUC_debugout_stub( const char *format, ...);
      |             ^~~~~~~~~~~~~~~~~~~~~
/usr/bin/rm -f libAfterStep.a
ar clq libAfterStep.a asapp.o ascommand.o asdatabase.o asfeel.o aswindata.o balloon.o canvas.o clientprops.o colorscheme.o decor.o desktop_category.o event.o freestor.o functions.o font.o hints.o kde.o module.o moveresize.o myicon.o mylook.o mystyle.o mystyle_property.o outline.o operations.o parser.o parser_fs.o parser_xml.o screen.o session.o shape.o wmprops.o
ranlib libAfterStep.a
gmake[1]: Leaving directory '/home/pbulk/build/wm/afterstep/work/afterstep-devel-2.2.12/libAfterStep'
gmake[1]: Entering directory '/home/pbulk/build/wm/afterstep/work/afterstep-devel-2.2.12/libAfterConf'
Compiling with :gcc -DNO_DEBUG_OUTPUT -pipe -fno-aggressive-loop-optimizations -pipe -fno-aggressive-loop-optimizations -D_FORTIFY_SOURCE=2 -I/opt/pkg/include -I/opt/pkg/include/libdrm -I/usr/include -I/opt/pkg/include/freetype2 -I/opt/pkg/include/glib-2.0 -I/opt/pkg/include/gio-unix-2.0 -I/opt/pkg/lib/glib-2.0/include -I/opt/pkg/include/harfbuzz -fPIC    
 AfterStep.c
In file included from AfterStep.c:31:
../libAfterStep/session.h:52:20: warning: inline function 'get_session_override' declared but never defined
   52 | inline const char *get_session_override(ASSession * session, int function );
      |                    ^~~~~~~~~~~~~~~~~~~~
In file included from ../libAfterStep/screen.h:15,
                 from AfterStep.c:29:
../libAfterStep/mylook.h:400:25: warning: inline function 'add_deskconfig_to_list' declared but never defined
  400 | inline MyDesktopConfig *add_deskconfig_to_list( ASHashTable *list, MyDesktopConfig *dc );
      |                         ^~~~~~~~~~~~~~~~~~~~~~
In file included from ../libAfterStep/../include/afterbase.h:2,
                 from ../libAfterStep/asapp.h:45,
                 from AfterStep.c:24:
../libAfterStep/../include/../libAfterBase/output.h:59:13: warning: inline function 'nonGNUC_debugout_stub' declared but never defined
   59 | inline void nonGNUC_debugout_stub( const char *format, ...);
      |             ^~~~~~~~~~~~~~~~~~~~~
 AlignBevel.c
In file included from ../libAfterStep/screen.h:15,
                 from AlignBevel.c:29:
../libAfterStep/mylook.h:400:25: warning: inline function 'add_deskconfig_to_list' declared but never defined
  400 | inline MyDesktopConfig *add_deskconfig_to_list( ASHashTable *list, MyDesktopConfig *dc );
      |                         ^~~~~~~~~~~~~~~~~~~~~~
In file included from ../libAfterStep/../include/afterbase.h:2,
                 from ../libAfterStep/asapp.h:45,
                 from AlignBevel.c:24:
../libAfterStep/../include/../libAfterBase/output.h:59:13: warning: inline function 'nonGNUC_debugout_stub' declared but never defined
   59 | inline void nonGNUC_debugout_stub( const char *format, ...);
      |             ^~~~~~~~~~~~~~~~~~~~~
 Animate.c
In file included from afterconf.h:7,
                 from Animate.c:31:
../libAfterStep/mylook.h:400:25: warning: inline function 'add_deskconfig_to_list' declared but never defined
  400 | inline MyDesktopConfig *add_deskconfig_to_list( ASHashTable *list, MyDesktopConfig *dc );
      |                         ^~~~~~~~~~~~~~~~~~~~~~
In file included from ../libAfterStep/../include/afterbase.h:2,
                 from ../libAfterStep/asapp.h:45,
                 from Animate.c:26:
../libAfterStep/../include/../libAfterBase/output.h:59:13: warning: inline function 'nonGNUC_debugout_stub' declared but never defined
   59 | inline void nonGNUC_debugout_stub( const char *format, ...);
      |             ^~~~~~~~~~~~~~~~~~~~~
 ASetRoot.c
In file included from ../libAfterStep/screen.h:15,
                 from ASetRoot.c:25:
../libAfterStep/mylook.h:400:25: warning: inline function 'add_deskconfig_to_list' declared but never defined
  400 | inline MyDesktopConfig *add_deskconfig_to_list( ASHashTable *list, MyDesktopConfig *dc );
      |                         ^~~~~~~~~~~~~~~~~~~~~~
In file included from ../libAfterStep/../include/afterbase.h:2,
                 from ../libAfterStep/asapp.h:45,
                 from ASetRoot.c:21:
../libAfterStep/../include/../libAfterBase/output.h:59:13: warning: inline function 'nonGNUC_debugout_stub' declared but never defined
   59 | inline void nonGNUC_debugout_stub( const char *format, ...);
      |             ^~~~~~~~~~~~~~~~~~~~~
 ASMount.c
In file included from afterconf.h:7,
                 from ASMount.c:28:
../libAfterStep/mylook.h:400:25: warning: inline function 'add_deskconfig_to_list' declared but never defined
  400 | inline MyDesktopConfig *add_deskconfig_to_list( ASHashTable *list, MyDesktopConfig *dc );
      |                         ^~~~~~~~~~~~~~~~~~~~~~
In file included from ../libAfterStep/../include/afterbase.h:2,
                 from ../libAfterStep/asapp.h:45,
                 from ASMount.c:22:
../libAfterStep/../include/../libAfterBase/output.h:59:13: warning: inline function 'nonGNUC_debugout_stub' declared but never defined
   59 | inline void nonGNUC_debugout_stub( const char *format, ...);
      |             ^~~~~~~~~~~~~~~~~~~~~
 Sound.c
In file included from afterconf.h:7,
                 from Sound.c:35:
../libAfterStep/mylook.h:400:25: warning: inline function 'add_deskconfig_to_list' declared but never defined
  400 | inline MyDesktopConfig *add_deskconfig_to_list( ASHashTable *list, MyDesktopConfig *dc );
      |                         ^~~~~~~~~~~~~~~~~~~~~~
In file included from ../libAfterStep/../include/afterbase.h:2,
                 from ../libAfterStep/asapp.h:45,
                 from Sound.c:26:
../libAfterStep/../include/../libAfterBase/output.h:59:13: warning: inline function 'nonGNUC_debugout_stub' declared but never defined
   59 | inline void nonGNUC_debugout_stub( const char *format, ...);
      |             ^~~~~~~~~~~~~~~~~~~~~
 Base.c
In file included from Base.c:28:
../libAfterStep/session.h:52:20: warning: inline function 'get_session_override' declared but never defined
   52 | inline const char *get_session_override(ASSession * session, int function );
      |                    ^~~~~~~~~~~~~~~~~~~~
In file included from ../libAfterStep/screen.h:15,
                 from Base.c:26:
../libAfterStep/mylook.h:400:25: warning: inline function 'add_deskconfig_to_list' declared but never defined
  400 | inline MyDesktopConfig *add_deskconfig_to_list( ASHashTable *list, MyDesktopConfig *dc );
      |                         ^~~~~~~~~~~~~~~~~~~~~~
In file included from ../libAfterStep/../include/afterbase.h:2,
                 from ../libAfterStep/asapp.h:45,
                 from Base.c:24:
../libAfterStep/../include/../libAfterBase/output.h:59:13: warning: inline function 'nonGNUC_debugout_stub' declared but never defined
   59 | inline void nonGNUC_debugout_stub( const char *format, ...);
      |             ^~~~~~~~~~~~~~~~~~~~~
 balloon.c
In file included from balloon.c:30:
../libAfterStep/mylook.h:400:25: warning: inline function 'add_deskconfig_to_list' declared but never defined
  400 | inline MyDesktopConfig *add_deskconfig_to_list( ASHashTable *list, MyDesktopConfig *dc );
      |                         ^~~~~~~~~~~~~~~~~~~~~~
In file included from ../libAfterStep/../include/afterbase.h:2,
                 from ../libAfterStep/asapp.h:45,
                 from balloon.c:25:
../libAfterStep/../include/../libAfterBase/output.h:59:13: warning: inline function 'nonGNUC_debugout_stub' declared but never defined
   59 | inline void nonGNUC_debugout_stub( const char *format, ...);
      |             ^~~~~~~~~~~~~~~~~~~~~
 Clean.c
In file included from afterconf.h:7,
                 from Clean.c:31:
../libAfterStep/mylook.h:400:25: warning: inline function 'add_deskconfig_to_list' declared but never defined
  400 | inline MyDesktopConfig *add_deskconfig_to_list( ASHashTable *list, MyDesktopConfig *dc );
      |                         ^~~~~~~~~~~~~~~~~~~~~~
In file included from ../libAfterStep/../include/afterbase.h:2,
                 from ../libAfterStep/asapp.h:45,
                 from Clean.c:26:
../libAfterStep/../include/../libAfterBase/output.h:59:13: warning: inline function 'nonGNUC_debugout_stub' declared but never defined
   59 | inline void nonGNUC_debugout_stub( const char *format, ...);
      |             ^~~~~~~~~~~~~~~~~~~~~
 Color.c
In file included from ../libAfterStep/screen.h:15,
                 from Color.c:28:
../libAfterStep/mylook.h:400:25: warning: inline function 'add_deskconfig_to_list' declared but never defined
  400 | inline MyDesktopConfig *add_deskconfig_to_list( ASHashTable *list, MyDesktopConfig *dc );
      |                         ^~~~~~~~~~~~~~~~~~~~~~
In file included from Color.c:27:
../libAfterStep/session.h:52:20: warning: inline function 'get_session_override' declared but never defined
   52 | inline const char *get_session_override(ASSession * session, int function );
      |                    ^~~~~~~~~~~~~~~~~~~~
In file included from ../libAfterStep/../include/afterbase.h:2,
                 from ../libAfterStep/asapp.h:45,
                 from Color.c:23:
../libAfterStep/../include/../libAfterBase/output.h:59:13: warning: inline function 'nonGNUC_debugout_stub' declared but never defined
   59 | inline void nonGNUC_debugout_stub( const char *format, ...);
      |             ^~~~~~~~~~~~~~~~~~~~~
 Database.c
In file included from afterconf.h:7,
                 from Database.c:33:
../libAfterStep/mylook.h:400:25: warning: inline function 'add_deskconfig_to_list' declared but never defined
  400 | inline MyDesktopConfig *add_deskconfig_to_list( ASHashTable *list, MyDesktopConfig *dc );
      |                         ^~~~~~~~~~~~~~~~~~~~~~
In file included from Database.c:31:
../libAfterStep/session.h:52:20: warning: inline function 'get_session_override' declared but never defined
   52 | inline const char *get_session_override(ASSession * session, int function );
      |                    ^~~~~~~~~~~~~~~~~~~~
In file included from ../libAfterStep/../include/afterbase.h:2,
                 from ../libAfterStep/asapp.h:45,
                 from Database.c:26:
../libAfterStep/../include/../libAfterBase/output.h:59:13: warning: inline function 'nonGNUC_debugout_stub' declared but never defined
   59 | inline void nonGNUC_debugout_stub( const char *format, ...);
      |             ^~~~~~~~~~~~~~~~~~~~~
 DesktopEntry.c
In file included from afterconf.h:7,
                 from DesktopEntry.c:33:
../libAfterStep/mylook.h:400:25: warning: inline function 'add_deskconfig_to_list' declared but never defined
  400 | inline MyDesktopConfig *add_deskconfig_to_list( ASHashTable *list, MyDesktopConfig *dc );
      |                         ^~~~~~~~~~~~~~~~~~~~~~
In file included from DesktopEntry.c:30:
../libAfterStep/session.h:52:20: warning: inline function 'get_session_override' declared but never defined
   52 | inline const char *get_session_override(ASSession * session, int function );
      |                    ^~~~~~~~~~~~~~~~~~~~
In file included from ../libAfterStep/../include/afterbase.h:2,
                 from ../libAfterStep/asapp.h:45,
                 from DesktopEntry.c:28:
../libAfterStep/../include/../libAfterBase/output.h:59:13: warning: inline function 'nonGNUC_debugout_stub' declared but never defined
   59 | inline void nonGNUC_debugout_stub( const char *format, ...);
      |             ^~~~~~~~~~~~~~~~~~~~~
 Feel.c
Feel.c: In function 'ParseKeyBinding':
Feel.c:323:7: warning: implicit declaration of function 'XkbKeycodeToKeysym'; did you mean 'XKeycodeToKeysym'? [-Wimplicit-function-declaration]
  323 |   if (XkbKeycodeToKeysym (dpy, keycode, 0, 0) == keysym)
      |       ^~~~~~~~~~~~~~~~~~
      |       XKeycodeToKeysym
In file included from afterconf.h:7,
                 from Feel.c:30:
Feel.c: At top level:
../libAfterStep/mylook.h:400:25: warning: inline function 'add_deskconfig_to_list' declared but never defined
  400 | inline MyDesktopConfig *add_deskconfig_to_list( ASHashTable *list, MyDesktopConfig *dc );
      |                         ^~~~~~~~~~~~~~~~~~~~~~
In file included from ../libAfterStep/../include/afterbase.h:2,
                 from ../libAfterStep/asapp.h:45,
                 from Feel.c:24:
../libAfterStep/../include/../libAfterBase/output.h:59:13: warning: inline function 'nonGNUC_debugout_stub' declared but never defined
   59 | inline void nonGNUC_debugout_stub( const char *format, ...);
      |             ^~~~~~~~~~~~~~~~~~~~~
 function.c
In file included from ../libAfterStep/screen.h:15,
                 from function.c:25:
../libAfterStep/mylook.h:400:25: warning: inline function 'add_deskconfig_to_list' declared but never defined
  400 | inline MyDesktopConfig *add_deskconfig_to_list( ASHashTable *list, MyDesktopConfig *dc );
      |                         ^~~~~~~~~~~~~~~~~~~~~~
In file included from ../libAfterStep/../include/afterbase.h:2,
                 from ../libAfterStep/asapp.h:45,
                 from function.c:22:
../libAfterStep/../include/../libAfterBase/output.h:59:13: warning: inline function 'nonGNUC_debugout_stub' declared but never defined
   59 | inline void nonGNUC_debugout_stub( const char *format, ...);
      |             ^~~~~~~~~~~~~~~~~~~~~
 Ident.c
In file included from afterconf.h:7,
                 from Ident.c:27:
../libAfterStep/mylook.h:400:25: warning: inline function 'add_deskconfig_to_list' declared but never defined
  400 | inline MyDesktopConfig *add_deskconfig_to_list( ASHashTable *list, MyDesktopConfig *dc );
      |                         ^~~~~~~~~~~~~~~~~~~~~~
In file included from ../libAfterStep/../include/afterbase.h:2,
                 from ../libAfterStep/asapp.h:45,
                 from Ident.c:22:
../libAfterStep/../include/../libAfterBase/output.h:59:13: warning: inline function 'nonGNUC_debugout_stub' declared but never defined
   59 | inline void nonGNUC_debugout_stub( const char *format, ...);
      |             ^~~~~~~~~~~~~~~~~~~~~
 Look.c
In file included from ../libAfterStep/screen.h:15,
                 from Look.c:29:
../libAfterStep/mylook.h:400:25: warning: inline function 'add_deskconfig_to_list' declared but never defined
  400 | inline MyDesktopConfig *add_deskconfig_to_list( ASHashTable *list, MyDesktopConfig *dc );
      |                         ^~~~~~~~~~~~~~~~~~~~~~
In file included from ../libAfterStep/../include/afterbase.h:2,
                 from ../libAfterStep/asapp.h:45,
                 from Look.c:24:
../libAfterStep/../include/../libAfterBase/output.h:59:13: warning: inline function 'nonGNUC_debugout_stub' declared but never defined
   59 | inline void nonGNUC_debugout_stub( const char *format, ...);
      |             ^~~~~~~~~~~~~~~~~~~~~
 MyFrame.c
In file included from ../libAfterStep/screen.h:15,
                 from MyFrame.c:29:
../libAfterStep/mylook.h:400:25: warning: inline function 'add_deskconfig_to_list' declared but never defined
  400 | inline MyDesktopConfig *add_deskconfig_to_list( ASHashTable *list, MyDesktopConfig *dc );
      |                         ^~~~~~~~~~~~~~~~~~~~~~
In file included from ../libAfterStep/../include/afterbase.h:2,
                 from ../libAfterStep/asapp.h:45,
                 from MyFrame.c:24:
../libAfterStep/../include/../libAfterBase/output.h:59:13: warning: inline function 'nonGNUC_debugout_stub' declared but never defined
   59 | inline void nonGNUC_debugout_stub( const char *format, ...);
      |             ^~~~~~~~~~~~~~~~~~~~~
 MyStyle.c
In file included from MyStyle.c:28:
../libAfterStep/session.h:52:20: warning: inline function 'get_session_override' declared but never defined
   52 | inline const char *get_session_override(ASSession * session, int function );
      |                    ^~~~~~~~~~~~~~~~~~~~
In file included from ../libAfterStep/screen.h:15,
                 from MyStyle.c:27:
../libAfterStep/mylook.h:400:25: warning: inline function 'add_deskconfig_to_list' declared but never defined
  400 | inline MyDesktopConfig *add_deskconfig_to_list( ASHashTable *list, MyDesktopConfig *dc );
      |                         ^~~~~~~~~~~~~~~~~~~~~~
In file included from ../libAfterStep/../include/afterbase.h:2,
                 from ../libAfterStep/asapp.h:45,
                 from MyStyle.c:23:
../libAfterStep/../include/../libAfterBase/output.h:59:13: warning: inline function 'nonGNUC_debugout_stub' declared but never defined
   59 | inline void nonGNUC_debugout_stub( const char *format, ...);
      |             ^~~~~~~~~~~~~~~~~~~~~
 Pager.c
In file included from afterconf.h:7,
                 from Pager.c:28:
../libAfterStep/mylook.h:400:25: warning: inline function 'add_deskconfig_to_list' declared but never defined
  400 | inline MyDesktopConfig *add_deskconfig_to_list( ASHashTable *list, MyDesktopConfig *dc );
      |                         ^~~~~~~~~~~~~~~~~~~~~~
In file included from ../libAfterStep/../include/afterbase.h:2,
                 from ../libAfterStep/asapp.h:45,
                 from Pager.c:22:
../libAfterStep/../include/../libAfterBase/output.h:59:13: warning: inline function 'nonGNUC_debugout_stub' declared but never defined
   59 | inline void nonGNUC_debugout_stub( const char *format, ...);
      |             ^~~~~~~~~~~~~~~~~~~~~
 Wharf.c
In file included from afterconf.h:7,
                 from Wharf.c:28:
../libAfterStep/mylook.h:400:25: warning: inline function 'add_deskconfig_to_list' declared but never defined
  400 | inline MyDesktopConfig *add_deskconfig_to_list( ASHashTable *list, MyDesktopConfig *dc );
      |                         ^~~~~~~~~~~~~~~~~~~~~~
In file included from ../libAfterStep/../include/afterbase.h:2,
                 from ../libAfterStep/asapp.h:45,
                 from Wharf.c:22:
../libAfterStep/../include/../libAfterBase/output.h:59:13: warning: inline function 'nonGNUC_debugout_stub' declared but never defined
   59 | inline void nonGNUC_debugout_stub( const char *format, ...);
      |             ^~~~~~~~~~~~~~~~~~~~~
 WinList.c
In file included from afterconf.h:7,
                 from WinList.c:28:
../libAfterStep/mylook.h:400:25: warning: inline function 'add_deskconfig_to_list' declared but never defined
  400 | inline MyDesktopConfig *add_deskconfig_to_list( ASHashTable *list, MyDesktopConfig *dc );
      |                         ^~~~~~~~~~~~~~~~~~~~~~
In file included from ../libAfterStep/../include/afterbase.h:2,
                 from ../libAfterStep/asapp.h:45,
                 from WinList.c:22:
../libAfterStep/../include/../libAfterBase/output.h:59:13: warning: inline function 'nonGNUC_debugout_stub' declared but never defined
   59 | inline void nonGNUC_debugout_stub( const char *format, ...);
      |             ^~~~~~~~~~~~~~~~~~~~~
 WinTabs.c
In file included from afterconf.h:7,
                 from WinTabs.c:28:
../libAfterStep/mylook.h:400:25: warning: inline function 'add_deskconfig_to_list' declared but never defined
  400 | inline MyDesktopConfig *add_deskconfig_to_list( ASHashTable *list, MyDesktopConfig *dc );
      |                         ^~~~~~~~~~~~~~~~~~~~~~
In file included from ../libAfterStep/../include/afterbase.h:2,
                 from ../libAfterStep/asapp.h:45,
                 from WinTabs.c:22:
../libAfterStep/../include/../libAfterBase/output.h:59:13: warning: inline function 'nonGNUC_debugout_stub' declared but never defined
   59 | inline void nonGNUC_debugout_stub( const char *format, ...);
      |             ^~~~~~~~~~~~~~~~~~~~~
/usr/bin/rm -f libAfterConf.a
ar clq libAfterConf.a AfterStep.o AlignBevel.o Animate.o ASetRoot.o ASMount.o Sound.o Base.o balloon.o Clean.o Color.o Database.o DesktopEntry.o Feel.o function.o Ident.o Look.o MyFrame.o MyStyle.o Pager.o Wharf.o WinList.o WinTabs.o
ranlib libAfterConf.a
gcc -DNO_DEBUG_OUTPUT -pipe -fno-aggressive-loop-optimizations -pipe -fno-aggressive-loop-optimizations -D_FORTIFY_SOURCE=2 -I/opt/pkg/include -I/opt/pkg/include/libdrm -I/usr/include -I/opt/pkg/include/freetype2 -I/opt/pkg/include/glib-2.0 -I/opt/pkg/include/gio-unix-2.0 -I/opt/pkg/lib/glib-2.0/include -I/opt/pkg/include/harfbuzz -fPIC  -DPRINT_DESKTOP_ENTRIES    -c DesktopEntry.c -o PrintDesktopEntries.o
In file included from afterconf.h:7,
                 from DesktopEntry.c:33:
../libAfterStep/mylook.h:400:25: warning: inline function 'add_deskconfig_to_list' declared but never defined
  400 | inline MyDesktopConfig *add_deskconfig_to_list( ASHashTable *list, MyDesktopConfig *dc );
      |                         ^~~~~~~~~~~~~~~~~~~~~~
In file included from DesktopEntry.c:30:
../libAfterStep/session.h:52:20: warning: inline function 'get_session_override' declared but never defined
   52 | inline const char *get_session_override(ASSession * session, int function );
      |                    ^~~~~~~~~~~~~~~~~~~~
In file included from ../libAfterStep/../include/afterbase.h:2,
                 from ../libAfterStep/asapp.h:45,
                 from DesktopEntry.c:28:
../libAfterStep/../include/../libAfterBase/output.h:59:13: warning: inline function 'nonGNUC_debugout_stub' declared but never defined
   59 | inline void nonGNUC_debugout_stub( const char *format, ...);
      |             ^~~~~~~~~~~~~~~~~~~~~
gcc PrintDesktopEntries.o -L/opt/pkg/lib -Wl,-R/opt/pkg/lib -L/usr/lib/amd64 -Wl,-R/usr/lib/amd64 -rdynamic -L/opt/pkg/lib -Wl,-R/opt/pkg/lib -L/usr/lib/amd64 -Wl,-R/usr/lib/amd64 -rdynamic ../libAfterConf/libAfterConf.a ../libAfterStep/libAfterStep.a ../libAfterImage/libAfterImage.a ../libAfterBase/libAfterBase.a  -lXinerama -lX11  -lsocket  -lnsl  -lSM -lICE -lXext   -L/opt/pkg/lib -lfreetype -ltiff -lX11 -lsocket -lnsl -lSM -lICE -lXext -ljpeg -lpng -lz -lm -o PrintDesktopEntries
Undefined			first referenced
 symbol  			    in file
add_myback_to_list                  ../libAfterStep/libAfterStep.a(mylook.o)
stash_event_time                    ../libAfterStep/libAfterStep.a(event.o)
add_deskconfig_to_list              ../libAfterStep/libAfterStep.a(mylook.o)
ld: fatal: symbol referencing errors. No output written to PrintDesktopEntries
collect2: error: ld returned 1 exit status
gmake[1]: *** [Makefile:397: PrintDesktopEntries] Error 1
gmake[1]: Leaving directory '/home/pbulk/build/wm/afterstep/work/afterstep-devel-2.2.12/libAfterConf'
gmake: *** [Makefile:177: all] Error 1
*** Error code 2

Stop.
bmake[1]: stopped in /data/jenkins/workspace/pkgsrc-upstream-trunk/wm/afterstep
*** Error code 1

Stop.
bmake: stopped in /data/jenkins/workspace/pkgsrc-upstream-trunk/wm/afterstep