+ case "${usergroup_phase}" in
+ local run_cmd
+ run_cmd=run_su
+ shift
+ run_su /opt/pkg/bin/bmake all BATCH=1 DEPENDS_TARGET=/nonexistent PYTHON_VERSION_REQD=39 WRKLOG=/tmp/bulklog/TeXmacs-1.99.13nb12/work.log
+ su pbulk -c '"$@"' make /opt/pkg/bin/bmake all BATCH=1 DEPENDS_TARGET=/nonexistent PYTHON_VERSION_REQD=39 WRKLOG=/tmp/bulklog/TeXmacs-1.99.13nb12/work.log
=> Bootstrap dependency digest>=20211023: found digest-20220214
WARNING: [license.mk] Every package should define a LICENSE.
===> Building for TeXmacs-1.99.13nb12
[  0%] Automatic MOC for target texmacs_body
[  0%] Built target texmacs_body_autogen
[  0%] Building CXX object src/CMakeFiles/texmacs_body.dir/texmacs_body_autogen/mocs_compilation.cpp.o
In file included from /home/pbulk/build/editors/TeXmacs/work/TeXmacs-1.99.13/src/Graphics/Renderer/renderer.hpp:14,
                 from /home/pbulk/build/editors/TeXmacs/work/TeXmacs-1.99.13/src/Graphics/Renderer/basic_renderer.hpp:15,
                 from /home/pbulk/build/editors/TeXmacs/work/TeXmacs-1.99.13/src/texmacs_body_autogen/N6VS2FZKLA/../../Plugins/Qt/qt_simple_widget.hpp:16,
                 from /home/pbulk/build/editors/TeXmacs/work/TeXmacs-1.99.13/src/texmacs_body_autogen/N6VS2FZKLA/../../Plugins/Qt/qt_gui.hpp:20,
                 from /home/pbulk/build/editors/TeXmacs/work/TeXmacs-1.99.13/src/texmacs_body_autogen/N6VS2FZKLA/../../Plugins/Qt/QTMGuiHelper.hpp:15,
                 from /home/pbulk/build/editors/TeXmacs/work/TeXmacs-1.99.13/src/texmacs_body_autogen/N6VS2FZKLA/moc_QTMGuiHelper.cpp:10,
                 from /home/pbulk/build/editors/TeXmacs/work/TeXmacs-1.99.13/src/texmacs_body_autogen/mocs_compilation.cpp:4:
/home/pbulk/build/editors/TeXmacs/work/TeXmacs-1.99.13/src/Graphics/Bitmap_fonts/bitmap_font.hpp:170:58: error: 'font_glyphs extended(font_glyphs, double, SI)' redeclared as different kind of entity
  170 | font_glyphs extended (font_glyphs fng, double xf, SI penw);
      |                                                          ^
In file included from /usr/include/math.h:335,
                 from /opt/tools/gcc10/include/c++/10.3.0/bits/std_abs.h:40,
                 from /opt/tools/gcc10/include/c++/10.3.0/cstdlib:77,
                 from /opt/tools/gcc10/include/c++/10.3.0/bits/stl_algo.h:59,
                 from /opt/tools/gcc10/include/c++/10.3.0/algorithm:62,
                 from /home/pbulk/build/editors/TeXmacs/work/.buildlink/qt5/include/QtCore/qglobal.h:142,
                 from /home/pbulk/build/editors/TeXmacs/work/.buildlink/qt5/include/QtGui/qtguiglobal.h:43,
                 from /home/pbulk/build/editors/TeXmacs/work/.buildlink/qt5/include/QtWidgets/qtwidgetsglobal.h:43,
                 from /home/pbulk/build/editors/TeXmacs/work/.buildlink/qt5/include/QtWidgets/qapplication.h:43,
                 from /home/pbulk/build/editors/TeXmacs/work/.buildlink/qt5/include/QtWidgets/QApplication:1,
                 from /home/pbulk/build/editors/TeXmacs/work/TeXmacs-1.99.13/src/texmacs_body_autogen/N6VS2FZKLA/../../Plugins/Qt/QTMApplication.hpp:15,
                 from /home/pbulk/build/editors/TeXmacs/work/TeXmacs-1.99.13/src/texmacs_body_autogen/N6VS2FZKLA/moc_QTMApplication.cpp:10,
                 from /home/pbulk/build/editors/TeXmacs/work/TeXmacs-1.99.13/src/texmacs_body_autogen/mocs_compilation.cpp:2:
/usr/include/floatingpoint.h:73:18: note: previous declaration 'typedef unsigned int extended [3]'
   73 | typedef unsigned extended[3];
      |                  ^~~~~~~~
gmake[2]: *** [src/CMakeFiles/texmacs_body.dir/build.make:76: src/CMakeFiles/texmacs_body.dir/texmacs_body_autogen/mocs_compilation.cpp.o] Error 1
gmake[1]: *** [CMakeFiles/Makefile2:250: src/CMakeFiles/texmacs_body.dir/all] Error 2
gmake: *** [Makefile:136: all] Error 2
*** Error code 2

Stop.
bmake[1]: stopped in /data/jenkins/workspace/pkgsrc-upstream-trunk/editors/TeXmacs
*** Error code 1

Stop.
bmake: stopped in /data/jenkins/workspace/pkgsrc-upstream-trunk/editors/TeXmacs