+ case "${usergroup_phase}" in
+ local run_cmd
+ run_cmd=run_su
+ shift
+ run_su /opt/local/bin/bmake all BATCH=1 DEPENDS_TARGET=/nonexistent WRKLOG=/tmp/bulklog/vsearch-2.27.1/work.log
+ su pbulk -c '"$@"' make /opt/local/bin/bmake all BATCH=1 DEPENDS_TARGET=/nonexistent WRKLOG=/tmp/bulklog/vsearch-2.27.1/work.log
=> Bootstrap dependency digest>=20211023: found digest-20220214
===> Building for vsearch-2.27.1
/opt/local/bin/gmake  all-recursive
gmake[1]: Entering directory '/home/pbulk/build/biology/vsearch/work/vsearch-2.27.1'
Making all in src
gmake[2]: Entering directory '/home/pbulk/build/biology/vsearch/work/vsearch-2.27.1/src'
depbase=`echo align.o | sed 's|[^/]*$|.deps/&|;s|\.o$||'`;\
g++ -DHAVE_CONFIG_H -I. -I..   -I/opt/local/include -I/usr/include -Wall -Wsign-compare   -march=x86-64 -mtune=generic  -DNDEBUG -std=c++11 -pipe -O2 -msave-args -fno-aggressive-loop-optimizations -I/opt/local/include -I/usr/include -MT align.o -MD -MP -MF $depbase.Tpo -c -o align.o align.cc &&\
mv -f $depbase.Tpo $depbase.Po
In file included from align.cc:61:
vsearch.h:187:10: fatal error: byteswap.h: No such file or directory
  187 | #include <byteswap.h>
      |          ^~~~~~~~~~~~
compilation terminated.
gmake[2]: *** [Makefile:745: align.o] Error 1
gmake[2]: Leaving directory '/home/pbulk/build/biology/vsearch/work/vsearch-2.27.1/src'
gmake[1]: *** [Makefile:376: all-recursive] Error 1
gmake[1]: Leaving directory '/home/pbulk/build/biology/vsearch/work/vsearch-2.27.1'
gmake: *** [Makefile:317: all] Error 2
*** Error code 2

Stop.
bmake[1]: stopped in /data/jenkins/workspace/pkgsrc-trunk-x86_64/biology/vsearch
*** Error code 1

Stop.
bmake: stopped in /data/jenkins/workspace/pkgsrc-trunk-x86_64/biology/vsearch