+ case "${usergroup_phase}" in + local run_cmd + run_cmd=run_su + shift + run_su /opt/local/bin/bmake all BATCH=1 DEPENDS_TARGET=/nonexistent WRKLOG=/tmp/bulklog/openntpd-6.8p1/work.log + su pbulk -c '"$@"' make /opt/local/bin/bmake all BATCH=1 DEPENDS_TARGET=/nonexistent WRKLOG=/tmp/bulklog/openntpd-6.8p1/work.log => Bootstrap dependency digest>=20211023: found digest-20220214 ===> Building for openntpd-6.8p1 => Substituting "ntpd_h" in src/ntpd.h => Substituting "ntpd_m1" in src/ntpd.8 => Substituting "ntpd_m2" in src/ntpd.8 src/ntpctl.8 Making all in include Making all in compat CCLD libcompatnoopt.la CC socket.lo CC adjfreq_solaris.lo CC imsg.lo CC imsg-buffer.lo CC md5.lo CC progname.lo CC setproctitle.lo CC bsd-setresgid.lo CC bsd-setresuid.lo CC getifaddrs_solaris.lo CCLD libcompat.la Making all in src CC ntpd-client.o CC ntpd-config.o CC ntpd-constraint-disabled.o CC ntpd-control.o CC ntpd-log.o CC ntpd-ntp.o CC ntpd-ntp_dns.o CC ntpd-ntp_msg.o CC ntpd-ntpd.o CC ntpd-sensors.o sensors.c:23:10: fatal error: sys/sysctl.h: No such file or directory 23 | #include <sys/sysctl.h> | ^~~~~~~~~~~~~~ compilation terminated. *** [ntpd-sensors.o] Error code 1 bmake[1]: stopped in /home/pbulk/build/net/openntpd/work/openntpd-6.8p1/src 1 error bmake[1]: stopped in /home/pbulk/build/net/openntpd/work/openntpd-6.8p1/src *** [all-recursive] Error code 1 bmake: stopped in /home/pbulk/build/net/openntpd/work/openntpd-6.8p1 1 error bmake: stopped in /home/pbulk/build/net/openntpd/work/openntpd-6.8p1 *** Error code 2 Stop. bmake[1]: stopped in /data/jenkins/workspace/pkgsrc-trunk-x86_64/net/openntpd *** Error code 1 Stop. bmake: stopped in /data/jenkins/workspace/pkgsrc-trunk-x86_64/net/openntpd