+ case "${usergroup_phase}" in
+ local run_cmd
+ run_cmd=run_su
+ shift
+ run_su /opt/local/bin/bmake all BATCH=1 DEPENDS_TARGET=/nonexistent WRKLOG=/tmp/bulklog/macchina-6.1.8/work.log
+ su pbulk -c '"$@"' make /opt/local/bin/bmake all BATCH=1 DEPENDS_TARGET=/nonexistent WRKLOG=/tmp/bulklog/macchina-6.1.8/work.log
=> Bootstrap dependency digest>=20211023: found digest-20220214
===> Building for macchina-6.1.8
   Compiling libc v0.2.139
   Compiling proc-macro2 v1.0.49
   Compiling quote v1.0.21
   Compiling unicode-ident v1.0.4
   Compiling syn v1.0.107
   Compiling log v0.4.17
   Compiling version_check v0.9.4
   Compiling jobserver v0.1.24
   Compiling cfg-if v1.0.0
   Compiling cc v1.0.73
   Compiling pkg-config v0.3.25
   Compiling proc-macro-error-attr v1.0.4
   Compiling thiserror v1.0.38
   Compiling libz-sys v1.1.8
   Compiling proc-macro-error v1.0.4
   Compiling tinyvec_macros v0.1.0
   Compiling tinyvec v1.6.0
   Compiling thiserror-impl v1.0.38
   Compiling rustversion v1.0.9
   Compiling anyhow v1.0.65
   Compiling unicode-normalization v0.1.22
   Compiling libgit2-sys v0.13.4+1.4.2
   Compiling unicode-bidi v0.3.8
   Compiling bitflags v1.3.2
   Compiling num_threads v0.1.6
   Compiling itoa v1.0.3
   Compiling percent-encoding v2.2.0
   Compiling semver v1.0.14
   Compiling form_urlencoded v1.1.0
   Compiling time v0.3.14
   Compiling idna v0.3.0
   Compiling autocfg v1.1.0
   Compiling lock_api v0.4.8
   Compiling vergen v7.4.2
   Compiling url v2.3.1
   Compiling enum-iterator-derive v1.1.0
   Compiling parking_lot_core v0.9.3
   Compiling signal-hook v0.3.14
   Compiling enum-iterator v1.1.3
   Compiling rustc_version v0.4.0
   Compiling getset v0.1.2
   Compiling signal-hook-registry v1.4.0
   Compiling smallvec v1.9.0
   Compiling scopeguard v1.1.0
   Compiling serde_derive v1.0.152
   Compiling mio v0.8.4
   Compiling io-lifetimes v1.0.3
   Compiling serde v1.0.152
   Compiling signal-hook-mio v0.2.3
   Compiling parking_lot v0.12.1
   Compiling rustix v0.36.6
   Compiling memchr v2.5.0
   Compiling crossterm v0.25.0
   Compiling getrandom v0.2.7
   Compiling errno v0.2.8
   Compiling cassowary v0.3.0
   Compiling unicode-segmentation v1.10.0
   Compiling unicode-width v0.1.10
   Compiling tui v0.19.0
   Compiling rand_core v0.6.4
   Compiling dirs-sys v0.3.7
   Compiling ppv-lite86 v0.2.16
   Compiling serde_json v1.0.91
   Compiling byteorder v1.4.3
   Compiling heck v0.4.0
   Compiling os_str_bytes v6.3.0
   Compiling minimal-lexical v0.2.1
   Compiling nom v7.1.1
   Compiling clap_lex v0.3.0
   Compiling clap_derive v4.0.21
   Compiling sysctl v0.4.6
error[E0433]: failed to resolve: maybe a missing crate `sys`?
  --> /home/pbulk/build/sysutils/macchina/work/vendor/sysctl-0.4.6/src/lib.rs:76:9
   |
76 | pub use sys::ctl::*;
   |         ^^^ maybe a missing crate `sys`?
   |
   = help: consider adding `extern crate sys` to use the `sys` crate

error[E0433]: failed to resolve: maybe a missing crate `sys`?
  --> /home/pbulk/build/sysutils/macchina/work/vendor/sysctl-0.4.6/src/lib.rs:77:9
   |
77 | pub use sys::ctl_iter::*;
   |         ^^^ maybe a missing crate `sys`?
   |
   = help: consider adding `extern crate sys` to use the `sys` crate

error[E0432]: unresolved imports `sys::ctl::*`, `sys::ctl_iter::*`
  --> /home/pbulk/build/sysutils/macchina/work/vendor/sysctl-0.4.6/src/lib.rs:76:9
   |
76 | pub use sys::ctl::*;
   |         ^^^^^^^^^^^
77 | pub use sys::ctl_iter::*;
   |         ^^^^^^^^^^^^^^^^

Some errors have detailed explanations: E0432, E0433.
For more information about an error, try `rustc --explain E0432`.
error: could not compile `sysctl` (lib) due to 3 previous errors
warning: build failed, waiting for other jobs to finish...
*** Error code 101

Stop.
bmake[1]: stopped in /data/jenkins/workspace/pkgsrc-trunk-x86_64/sysutils/macchina
*** Error code 1

Stop.
bmake: stopped in /data/jenkins/workspace/pkgsrc-trunk-x86_64/sysutils/macchina