+ case "${usergroup_phase}" in
+ local run_cmd
+ run_cmd=run_su
+ shift
+ run_su /opt/local/bin/bmake all BATCH=1 DEPENDS_TARGET=/nonexistent WRKLOG=/tmp/bulklog/holtz-1.5.0nb8/work.log
+ su pbulk -c '"$@"' make /opt/local/bin/bmake all BATCH=1 DEPENDS_TARGET=/nonexistent WRKLOG=/tmp/bulklog/holtz-1.5.0nb8/work.log
=> Bootstrap dependency digest>=20211023: found digest-20220214
===> Building for holtz-1.5.0nb8
Making all in skins
gmake[1]: Entering directory '/home/pbulk/build/games/holtz/work/holtz-1.5.0/skins'
Making all in eins
gmake[2]: Entering directory '/home/pbulk/build/games/holtz/work/holtz-1.5.0/skins/eins'
gmake[2]: Nothing to be done for 'all'.
gmake[2]: Leaving directory '/home/pbulk/build/games/holtz/work/holtz-1.5.0/skins/eins'
gmake[2]: Entering directory '/home/pbulk/build/games/holtz/work/holtz-1.5.0/skins'
gmake[2]: Nothing to be done for 'all-am'.
gmake[2]: Leaving directory '/home/pbulk/build/games/holtz/work/holtz-1.5.0/skins'
gmake[1]: Leaving directory '/home/pbulk/build/games/holtz/work/holtz-1.5.0/skins'
Making all in sounds
gmake[1]: Entering directory '/home/pbulk/build/games/holtz/work/holtz-1.5.0/sounds'
gmake[1]: Nothing to be done for 'all'.
gmake[1]: Leaving directory '/home/pbulk/build/games/holtz/work/holtz-1.5.0/sounds'
Making all in locale
gmake[1]: Entering directory '/home/pbulk/build/games/holtz/work/holtz-1.5.0/locale'
Making all in de
gmake[2]: Entering directory '/home/pbulk/build/games/holtz/work/holtz-1.5.0/locale/de'
Making all in LC_MESSAGES
gmake[3]: Entering directory '/home/pbulk/build/games/holtz/work/holtz-1.5.0/locale/de/LC_MESSAGES'
gmake[3]: Nothing to be done for 'all'.
gmake[3]: Leaving directory '/home/pbulk/build/games/holtz/work/holtz-1.5.0/locale/de/LC_MESSAGES'
gmake[3]: Entering directory '/home/pbulk/build/games/holtz/work/holtz-1.5.0/locale/de'
gmake[3]: Nothing to be done for 'all-am'.
gmake[3]: Leaving directory '/home/pbulk/build/games/holtz/work/holtz-1.5.0/locale/de'
gmake[2]: Leaving directory '/home/pbulk/build/games/holtz/work/holtz-1.5.0/locale/de'
gmake[2]: Entering directory '/home/pbulk/build/games/holtz/work/holtz-1.5.0/locale'
gmake[2]: Nothing to be done for 'all-am'.
gmake[2]: Leaving directory '/home/pbulk/build/games/holtz/work/holtz-1.5.0/locale'
gmake[1]: Leaving directory '/home/pbulk/build/games/holtz/work/holtz-1.5.0/locale'
Making all in help
gmake[1]: Entering directory '/home/pbulk/build/games/holtz/work/holtz-1.5.0/help'
gmake[1]: Nothing to be done for 'all'.
gmake[1]: Leaving directory '/home/pbulk/build/games/holtz/work/holtz-1.5.0/help'
Making all in common
gmake[1]: Entering directory '/home/pbulk/build/games/holtz/work/holtz-1.5.0/common'
gmake[1]: Nothing to be done for 'all'.
gmake[1]: Leaving directory '/home/pbulk/build/games/holtz/work/holtz-1.5.0/common'
Making all in bloks
gmake[1]: Entering directory '/home/pbulk/build/games/holtz/work/holtz-1.5.0/bloks'
g++ -DPACKAGE_NAME=\"\" -DPACKAGE_TARNAME=\"\" -DPACKAGE_VERSION=\"\" -DPACKAGE_STRING=\"\" -DPACKAGE_BUGREPORT=\"\" -DPACKAGE_URL=\"\" -DPACKAGE=\"holtz\" -DVERSION=\"1.5.0\" -I. -I./.. -I.  -I/opt/local/include -I/usr/include -I/opt/local/include/wx-3.2 -I/opt/local/include/glib-2.0 -I/opt/local/include/gio-unix-2.0 -I/opt/local/lib/glib-2.0/include -I/opt/local/include/freetype2 -I/opt/local/include/harfbuzz -I/opt/local/include/libdrm -DDEFAULT_DATA_DIR=\"/opt/local/share/holtz/\" -pipe -O2 -msave-args -fno-aggressive-loop-optimizations -pthread -I/opt/local/include -I/usr/include -I/opt/local/include/wx-3.2 -I/opt/local/include/glib-2.0 -I/opt/local/include/gio-unix-2.0 -I/opt/local/lib/glib-2.0/include -I/opt/local/include/freetype2 -I/opt/local/include/harfbuzz -I/opt/local/include/libdrm  -I/opt/local/lib/wx/include/gtk3-unicode-3.2 -I/opt/local/include/wx-3.2 -D_FILE_OFFSET_BITS=64 -DWXUSINGDLL -D__WXGTK__ -pthreads -D_REENTRANT -MT libbloks_a-bloks.o -MD -MP -MF .deps/libbloks_a-bloks.Tpo -c -o libbloks_a-bloks.o `test -f 'bloks.cpp' || echo './'`bloks.cpp
In file included from bloks.cpp:17:
bloks.hpp:297:43: error: ISO C++17 does not allow dynamic exception specifications
  297 |     virtual Player_State determine_move() throw(Exception) = 0;
      |                                           ^~~~~
bloks.hpp:694:32: error: ISO C++17 does not allow dynamic exception specifications
  694 |     Game_State continue_game() throw(Exception); // start or continue game
      |                                ^~~~~
bloks.hpp:879:43: error: ISO C++17 does not allow dynamic exception specifications
  879 |     virtual Player_State determine_move() throw(Exception);
      |                                           ^~~~~
bloks.hpp:954:43: error: ISO C++17 does not allow dynamic exception specifications
  954 |     virtual Player_State determine_move() throw(Exception);
      |                                           ^~~~~
bloks.cpp:1640:42: error: ISO C++17 does not allow dynamic exception specifications
 1640 |   Game::Game_State Game::continue_game() throw(Exception)
      |                                          ^~~~~
bloks.cpp:3173:61: error: ISO C++17 does not allow dynamic exception specifications
 3173 |   Player_Input::Player_State Stream_Input::determine_move() throw(Exception)
      |                                                             ^~~~~
bloks.cpp:3510:68: error: ISO C++17 does not allow dynamic exception specifications
 3510 |   Player_Input::Player_State Generic_Mouse_Input::determine_move() throw(Exception)
      |                                                                    ^~~~~
gmake[1]: *** [Makefile:368: libbloks_a-bloks.o] Error 1
gmake[1]: Leaving directory '/home/pbulk/build/games/holtz/work/holtz-1.5.0/bloks'
gmake: *** [Makefile:561: all-recursive] Error 1
*** Error code 2

Stop.
bmake[1]: stopped in /data/jenkins/workspace/pkgsrc-trunk-x86_64/games/holtz
*** Error code 1

Stop.
bmake: stopped in /data/jenkins/workspace/pkgsrc-trunk-x86_64/games/holtz