+ case "${usergroup_phase}" in
+ local run_cmd
+ run_cmd=run_su
+ shift
+ run_su /opt/local/bin/bmake all BATCH=1 DEPENDS_TARGET=/nonexistent PYTHON_VERSION_REQD=310 WRKLOG=/tmp/bulklog/broot-1.20.2/work.log
+ su pbulk -c '"$@"' make /opt/local/bin/bmake all BATCH=1 DEPENDS_TARGET=/nonexistent PYTHON_VERSION_REQD=310 WRKLOG=/tmp/bulklog/broot-1.20.2/work.log
=> Bootstrap dependency digest>=20211023: found digest-20220214
===> Building for broot-1.20.2
   Compiling autocfg v1.1.0
   Compiling libc v0.2.139
   Compiling proc-macro2 v1.0.50
   Compiling unicode-ident v1.0.6
   Compiling quote v1.0.23
   Compiling cfg-if v1.0.0
   Compiling syn v1.0.107
   Compiling scopeguard v1.1.0
   Compiling log v0.4.17
   Compiling bitflags v1.3.2
   Compiling version_check v0.9.4
   Compiling crossbeam-utils v0.8.14
   Compiling memchr v2.5.0
   Compiling jobserver v0.1.25
   Compiling cc v1.0.79
   Compiling memoffset v0.7.1
   Compiling lock_api v0.4.9
   Compiling adler v1.0.2
   Compiling pkg-config v0.3.26
   Compiling smallvec v1.10.0
   Compiling crossbeam-epoch v0.9.13
   Compiling indexmap v1.9.2
   Compiling serde_derive v1.0.152
   Compiling crc32fast v1.3.2
   Compiling miniz_oxide v0.6.2
   Compiling serde v1.0.152
   Compiling proc-macro-error-attr v1.0.4
   Compiling bytemuck v1.13.0
   Compiling heck v0.4.1
   Compiling once_cell v1.17.0
   Compiling flate2 v1.0.25
   Compiling crossbeam-deque v0.8.2
   Compiling crossbeam-channel v0.5.6
   Compiling proc-macro-error v1.0.4
   Compiling num_cpus v1.15.0
   Compiling signal-hook v0.3.14
   Compiling parking_lot_core v0.9.7
   Compiling mio v0.8.5
   Compiling signal-hook-registry v1.4.0
   Compiling num-traits v0.2.15
   Compiling thiserror v1.0.38
   Compiling rayon-core v1.10.2
   Compiling float-cmp v0.9.0
   Compiling getrandom v0.2.8
   Compiling thiserror-impl v1.0.38
   Compiling num-integer v0.1.45
   Compiling siphasher v0.3.10
   Compiling tinyvec_macros v0.1.1
   Compiling xmlparser v0.13.5
   Compiling roxmltree v0.15.1
   Compiling tinyvec v1.6.0
   Compiling parking_lot v0.12.1
   Compiling clap_derive v3.2.18
   Compiling signal-hook-mio v0.2.3
   Compiling rand_core v0.6.4
   Compiling strict-num v0.1.0
   Compiling libz-sys v1.1.8
   Compiling memoffset v0.6.5
   Compiling ppv-lite86 v0.2.17
   Compiling base64 v0.13.1
   Compiling futures-core v0.3.26
   Compiling unicode-general-category v0.6.0
   Compiling either v1.8.1
   Compiling os_str_bytes v6.4.1
   Compiling arrayvec v0.7.2
   Compiling unicode-bidi v0.3.10
   Compiling hashbrown v0.12.3
   Compiling clap_lex v0.2.4
   Compiling rayon v1.6.1
   Compiling rand_chacha v0.3.1
   Compiling crossterm v0.23.2
   Compiling aho-corasick v0.7.20
   Compiling unicode-normalization v0.1.22
   Compiling onig_sys v69.8.1
   Compiling miniz_oxide v0.5.4
   Compiling atty v0.2.14
   Compiling pin-project-internal v1.0.12
   Compiling crossbeam-queue v0.3.8
   Compiling ttf-parser v0.17.1
   Compiling proc-macro-hack v0.5.20+deprecated
   Compiling weezl v0.1.7
   Compiling termcolor v1.2.0
   Compiling regex-syntax v0.6.28
   Compiling textwrap v0.16.0
   Compiling strsim v0.10.0
   Compiling itoa v1.0.5
   Compiling doc-comment v0.3.3
   Compiling phf_shared v0.10.0
   Compiling clap v3.2.23
   Compiling regex v1.7.1
   Compiling pin-project v1.0.12
   Compiling png v0.17.6
   Compiling rand v0.8.5
   Compiling jpeg-decoder v0.3.0
   Compiling kurbo v0.8.3
   Compiling nanorand v0.7.0
   Compiling fontconfig-parser v0.5.1
   Compiling svgtypes v0.8.2
   Compiling rgb v0.8.34
   Compiling spin v0.9.4
   Compiling libgit2-sys v0.13.5+1.4.5
   Compiling simplecss v0.2.1
   Compiling memmap2 v0.5.8
   Compiling num-rational v0.4.1
   Compiling unicode-bidi-mirroring v0.1.0
   Compiling futures-sink v0.3.26
   Compiling arrayref v0.3.6
   Compiling imagesize v0.10.1
   Compiling percent-encoding v2.2.0
   Compiling safemem v0.3.3
   Compiling rctree v0.5.0
   Compiling time-core v0.1.0
   Compiling unicode-script v0.5.5
   Compiling serde_json v1.0.91
   Compiling unicode-ccc v0.1.2
   Compiling data-url v0.2.0
   Compiling color_quant v1.1.0
   Compiling gif v0.11.4
   Compiling usvg v0.28.0
   Compiling rustybuzz v0.6.0
   Compiling time v0.3.17
   Compiling line-wrap v0.1.1
   Compiling form_urlencoded v1.1.0
   Compiling tiny-skia-path v0.8.2
   Compiling flume v0.10.14
   Compiling fontdb v0.10.0
   Compiling phf_generator v0.10.0
   Compiling nix v0.22.3
   Compiling lazy-regex-proc_macros v2.4.1
   Compiling clap_complete v3.2.5
   Compiling idna v0.3.0
   Compiling coolor v0.5.0
   Compiling quick-xml v0.26.0
   Compiling threadpool v1.8.1
   Compiling snafu-derive v0.7.4
   Compiling ahash v0.7.6
   Compiling time v0.1.45
   Compiling lebe v0.5.2
   Compiling linked-hash-map v0.5.6
   Compiling bit_field v0.10.1
   Compiling iana-time-zone v0.1.53
   Compiling same-file v1.0.6
   Compiling unicode-vo v0.1.0
   Compiling half v2.2.1
   Compiling ryu v1.0.12
   Compiling exr v1.5.2
   Compiling usvg-text-layout v0.28.0
   Compiling walkdir v2.3.2
   Compiling chrono v0.4.23
   Compiling yaml-rust v0.4.5
   Compiling snafu v0.7.4
   Compiling plist v1.4.0
   Compiling url v2.3.1
   Compiling broot v1.20.2 (/home/pbulk/build/sysutils/broot/work/broot-1.20.2)
   Compiling lazy-regex v2.4.1
   Compiling phf_macros v0.10.0
   Compiling crossbeam v0.8.2
   Compiling xterm-query v0.2.0
   Compiling tiny-skia v0.8.2
   Compiling svgfilters v0.4.0
   Compiling tiff v0.8.1
   Compiling proc-status v0.1.1
   Compiling bincode v1.3.3
   Compiling minimad v0.10.0
   Compiling crokey-proc_macros v0.4.0
   Compiling include_dir_macros v0.7.3
   Compiling dirs-sys v0.3.7
   Compiling fnv v1.0.7
   Compiling pico-args v0.5.0
   Compiling lazy_static v1.4.0
   Compiling scoped_threadpool v0.1.9
   Compiling remove_dir_all v0.5.3
   Compiling byteorder v1.4.3
   Compiling fastrand v1.8.0
   Compiling unicode-width v0.1.10
   Compiling file-size v1.0.3
   Compiling cli-log v2.0.0
   Compiling termimad v0.21.0
   Compiling tempfile v3.3.0
   Compiling image v0.24.5
   Compiling resvg v0.28.0
   Compiling directories v4.0.1
   Compiling include_dir v0.7.3
   Compiling crokey v0.4.3
   Compiling phf v0.10.1
   Compiling terminal-light v1.1.1
   Compiling lfs-core v0.11.1
   Compiling ansi_colours v1.2.1
   Compiling secular v1.0.1
   Compiling deser-hjson v1.1.0
   Compiling toml v0.5.11
   Compiling users v0.11.0
error[E0433]: failed to resolve: could not find `UserExtras` in `os`
  --> /home/pbulk/build/sysutils/broot/work/vendor/users-0.11.0/src/base.rs:78:26
   |
78 |         let extras = os::UserExtras::default();
   |                          ^^^^^^^^^^ could not find `UserExtras` in `os`

error[E0433]: failed to resolve: could not find `GroupExtras` in `os`
   --> /home/pbulk/build/sysutils/broot/work/vendor/users-0.11.0/src/base.rs:192:26
    |
192 |         let extras = os::GroupExtras::default();
    |                          ^^^^^^^^^^^ could not find `GroupExtras` in `os`

error[E0433]: failed to resolve: could not find `UserExtras` in `os`
   --> /home/pbulk/build/sysutils/broot/work/vendor/users-0.11.0/src/base.rs:266:28
    |
266 |         extras:        os::UserExtras::from_passwd(passwd),
    |                            ^^^^^^^^^^ could not find `UserExtras` in `os`

error[E0433]: failed to resolve: could not find `GroupExtras` in `os`
   --> /home/pbulk/build/sysutils/broot/work/vendor/users-0.11.0/src/base.rs:280:23
    |
280 |         extras:   os::GroupExtras::from_struct(group),
    |                       ^^^^^^^^^^^ could not find `GroupExtras` in `os`

error[E0412]: cannot find type `UserExtras` in module `os`
  --> /home/pbulk/build/sysutils/broot/work/vendor/users-0.11.0/src/base.rs:57:17
   |
57 |     extras: os::UserExtras,
   |                 ^^^^^^^^^^ not found in `os`

error[E0412]: cannot find type `GroupExtras` in module `os`
   --> /home/pbulk/build/sysutils/broot/work/vendor/users-0.11.0/src/base.rs:171:17
    |
171 |     extras: os::GroupExtras,
    |                 ^^^^^^^^^^^ not found in `os`

Some errors have detailed explanations: E0412, E0433.
For more information about an error, try `rustc --explain E0412`.
error: could not compile `users` due to 6 previous errors
warning: build failed, waiting for other jobs to finish...
*** Error code 101

Stop.
bmake[1]: stopped in /data/jenkins/workspace/pkgsrc-trunk-x86_64/sysutils/broot
*** Error code 1

Stop.
bmake: stopped in /data/jenkins/workspace/pkgsrc-trunk-x86_64/sysutils/broot