+ case "${usergroup_phase}" in
+ local run_cmd
+ run_cmd=run_su
+ shift
+ run_su /usr/pkg/bin/bmake all BATCH=1 DEPENDS_TARGET=/nonexistent WRKLOG=/tmp/bulklog/podman-4.4.1nb7/work.log
+ su pbulk -c '"$@"' make /usr/pkg/bin/bmake all BATCH=1 DEPENDS_TARGET=/nonexistent WRKLOG=/tmp/bulklog/podman-4.4.1nb7/work.log
=> Bootstrap dependency digest>=20211023: found digest-20220214
===> Building for podman-4.4.1nb7
fatal: not a git repository (or any of the parent directories): .git
mkdir -p bin
CGO_ENABLED=1 \
	go build \
	 \
	-o bin/rootlessport ./cmd/rootlessport
Podman is being compiled without the systemd build tag. 	Install libsystemd on Ubuntu or systemd-devel on rpm based 	distro for journald support.
fatal: not a git repository (or any of the parent directories): .git
CGO_ENABLED=1 GOOS=linux GOARCH=amd64 go build \
	 \
	-ldflags ' -X github.com/containers/podman/v4/libpod/define.buildInfo=1703670620 -X github.com/containers/podman/v4/libpod/config._installPrefix=/usr/pkg -X github.com/containers/podman/v4/libpod/config._etcDir=/usr/pkg/etc -X github.com/containers/podman/v4/pkg/systemd/quadlet._binDir=/usr/pkg/bin -X github.com/containers/common/pkg/config.additionalHelperBinariesDir= ' \
	-tags " exclude_graphdriver_btrfs btrfs_noversion    exclude_graphdriver_devicemapper seccomp" \
	-o bin/podman ./cmd/podman
go build github.com/proglottis/gpgme:
# /home/pbulk/build/sysutils/podman/work/.tools/bin/pkg-config --cflags  -- gpgme
../.tools/bin/pkg-config: exit status 1
go build github.com/seccomp/libseccomp-golang:
# /home/pbulk/build/sysutils/podman/work/.tools/bin/pkg-config --cflags  -- libseccomp
../.tools/bin/pkg-config: exit status 1
CGO_ENABLED=1 GOOS=linux GOARCH=amd64 go build \
	 \
	-ldflags ' -X github.com/containers/podman/v4/libpod/define.buildInfo=1703670620 -X github.com/containers/podman/v4/libpod/config._installPrefix=/usr/pkg -X github.com/containers/podman/v4/libpod/config._etcDir=/usr/pkg/etc -X github.com/containers/podman/v4/pkg/systemd/quadlet._binDir=/usr/pkg/bin -X github.com/containers/common/pkg/config.additionalHelperBinariesDir= ' \
	-tags " exclude_graphdriver_btrfs btrfs_noversion    exclude_graphdriver_devicemapper seccomp" \
	-o bin/quadlet ./cmd/quadlet
# github.com/containers/podman/v4/libpod/lock/shm
libpod/lock/shm/shm_lock.go:53:11: could not determine kind of name for C.CString
libpod/lock/shm/shm_lock.go:164:13: could not determine kind of name for C.allocate_given_semaphore
libpod/lock/shm/shm_lock.go:137:13: could not determine kind of name for C.allocate_semaphore
libpod/lock/shm/shm_lock.go:31:22: could not determine kind of name for C.bitmap_size_c
libpod/lock/shm/shm_lock.go:116:13: could not determine kind of name for C.close_lock_shm
libpod/lock/shm/shm_lock.go:200:13: could not determine kind of name for C.deallocate_all_semaphores
libpod/lock/shm/shm_lock.go:184:13: could not determine kind of name for C.deallocate_semaphore
libpod/lock/shm/shm_lock.go:54:8: could not determine kind of name for C.free
libpod/lock/shm/shm_lock.go:56:14: could not determine kind of name for C.int
libpod/lock/shm/shm_lock.go:229:13: could not determine kind of name for C.lock_semaphore
libpod/lock/shm/shm_lock.go:86:16: could not determine kind of name for C.open_lock_shm
libpod/lock/shm/shm_lock.go:57:16: could not determine kind of name for C.setup_lock_shm
libpod/lock/shm/shm_lock.go:37:14: could not determine kind of name for C.shm_struct_t
libpod/lock/shm/shm_lock.go:273:15: could not determine kind of name for C.shm_unlink
libpod/lock/shm/shm_lock.go:57:40: could not determine kind of name for C.uint32_t
libpod/lock/shm/shm_lock.go:253:13: could not determine kind of name for C.unlock_semaphore
cgo: 
cc errors for preamble:
In file included from /usr/include/bits/libc-header-start.h:33,
                 from /usr/include/stdlib.h:25,
                 from libpod/lock/shm/shm_lock.go:9:
/usr/include/features.h:412:4: error: #warning _FORTIFY_SOURCE requires compiling with optimization (-O) [-Werror=cpp]
  412 | #  warning _FORTIFY_SOURCE requires compiling with optimization (-O)
      |    ^~~~~~~
cc1: all warnings being treated as errors

hack/markdown-preprocess
if [ ! -x "./test/tools/build/go-md2man" ]; then \
	/bin/make -C test/tools build/go-md2man ; \
fi
make[1]: Entering directory '/home/pbulk/build/sysutils/podman/work/podman-4.4.1/test/tools'
go build -o build/go-md2man ./vendor/github.com/cpuguy83/go-md2man/v2
make[1]: Leaving directory '/home/pbulk/build/sysutils/podman/work/podman-4.4.1/test/tools'
mkdir -p docs/build/man
fatal: not a git repository (or any of the parent directories): .git
CGO_ENABLED=1 GOOS=linux GOARCH=amd64 go build \
	 \
	-ldflags ' -X github.com/containers/podman/v4/libpod/define.buildInfo=1703670760 -X github.com/containers/podman/v4/libpod/config._installPrefix=/usr/pkg -X github.com/containers/podman/v4/libpod/config._etcDir=/usr/pkg/etc -X github.com/containers/podman/v4/pkg/systemd/quadlet._binDir=/usr/pkg/bin -X github.com/containers/common/pkg/config.additionalHelperBinariesDir= ' \
	-tags "remote exclude_graphdriver_btrfs btrfs_noversion exclude_graphdriver_devicemapper containers_image_openpgp" \
	-o bin/podman-remote ./cmd/podman
# github.com/containers/podman/v4/pkg/rootless
pkg/rootless/rootless_linux.go:179:15: could not determine kind of name for C.CString
pkg/rootless/rootless_linux.go:180:8: could not determine kind of name for C.free
pkg/rootless/rootless_linux.go:182:31: could not determine kind of name for C.int
pkg/rootless/rootless_linux.go:624:13: could not determine kind of name for C.is_fd_inherited
pkg/rootless/rootless_linux.go:319:10: could not determine kind of name for C.reexec_in_user_namespace
pkg/rootless/rootless_linux.go:187:9: could not determine kind of name for C.reexec_in_user_namespace_wait
pkg/rootless/rootless_linux.go:182:10: could not determine kind of name for C.reexec_userns_join
pkg/rootless/rootless_linux.go:61:26: could not determine kind of name for C.rootless_gid
pkg/rootless/rootless_linux.go:60:26: could not determine kind of name for C.rootless_uid
cgo: 
cc errors for preamble:
In file included from /usr/include/bits/libc-header-start.h:33,
                 from /usr/include/stdlib.h:25,
                 from pkg/rootless/rootless_linux.go:33:
/usr/include/features.h:412:4: error: #warning _FORTIFY_SOURCE requires compiling with optimization (-O) [-Werror=cpp]
  412 | #  warning _FORTIFY_SOURCE requires compiling with optimization (-O)
      |    ^~~~~~~
cc1: all warnings being treated as errors

make: *** [Makefile:322: bin/podman] Error 1
make: *** Waiting for unfinished jobs....
make: *** [Makefile:337: bin/podman-remote] Error 1
*** Error code 2

Stop.
bmake[1]: stopped in /data/jenkins/workspace/pkgsrc-el9-trunk-x86_64/sysutils/podman
*** Error code 1

Stop.
bmake: stopped in /data/jenkins/workspace/pkgsrc-el9-trunk-x86_64/sysutils/podman