+ case "${usergroup_phase}" in
+ local run_cmd
+ run_cmd=run_su
+ shift
+ run_su /usr/pkg/bin/bmake all BATCH=1 DEPENDS_TARGET=/nonexistent WRKLOG=/tmp/bulklog/stfl-0.24nb8/work.log
+ su pbulk -c '"$@"' make /usr/pkg/bin/bmake all BATCH=1 DEPENDS_TARGET=/nonexistent WRKLOG=/tmp/bulklog/stfl-0.24nb8/work.log
=> Bootstrap dependency digest>=20211023: found digest-20220214
===> Building for stfl-0.24nb8
Makefile:85: Makefile.deps: No such file or directory
cc -I. -MM *.c > Makefile.deps_new
cc -I. -MM widgets/*.c | sed 's,^wt_[^ ]*\.o: ,widgets/&,' >> Makefile.deps_new
mv -f Makefile.deps_new Makefile.deps
libtool --mode=compile cc -o public.lo -c -pipe -O2 -I/usr/include -DNCURSES_WIDECHAR=1 -I/usr/pkg/include/ncurses -I. -Wall -D_GNU_SOURCE -pthread public.c
libtool --mode=compile cc -o base.lo -c -pipe -O2 -I/usr/include -DNCURSES_WIDECHAR=1 -I/usr/pkg/include/ncurses -I. -Wall -D_GNU_SOURCE -pthread base.c
libtool: compile:  cc -c -pipe -O2 -DNCURSES_WIDECHAR=1 -I/home/pbulk/build/devel/stfl/work/.buildlink/include/ncurses -I. -Wall -D_GNU_SOURCE -pthread base.c  -fPIC -DPIC -o .libs/base.o
libtool: compile:  cc -c -pipe -O2 -DNCURSES_WIDECHAR=1 -I/home/pbulk/build/devel/stfl/work/.buildlink/include/ncurses -I. -Wall -D_GNU_SOURCE -pthread public.c  -fPIC -DPIC -o .libs/public.o
In file included from base.c:23:0:
stfl_internals.h:35:31: fatal error: ncursesw/ncurses.h: No such file or directory
 # include <ncursesw/ncurses.h>
                               ^
compilation terminated.
In file included from public.c:23:0:
stfl_internals.h:35:31: fatal error: ncursesw/ncurses.h: No such file or directory
 # include <ncursesw/ncurses.h>
                               ^
compilation terminated.
make: *** [public.lo] Error 1
make: *** Waiting for unfinished jobs....
make: *** [base.lo] Error 1
*** Error code 2

Stop.
bmake[1]: stopped making "all" in /data/jenkins/workspace/pkgsrc-el7-trunk-x86_64/devel/stfl
*** Error code 1

Stop.
bmake: stopped making "all" in /data/jenkins/workspace/pkgsrc-el7-trunk-x86_64/devel/stfl