+ case "${usergroup_phase}" in
+ local run_cmd
+ run_cmd=run_su
+ shift
+ run_su /usr/pkg/bin/bmake all BATCH=1 DEPENDS_TARGET=/nonexistent WRKLOG=/tmp/bulklog/stockfish-9/work.log
+ su pbulk -c '"$@"' make /usr/pkg/bin/bmake all BATCH=1 DEPENDS_TARGET=/nonexistent WRKLOG=/tmp/bulklog/stockfish-9/work.log
=> Bootstrap dependency digest>=20211023: found digest-20220214
===> Building for stockfish-9
g++ -pipe -O2 -pipe -O2 -D_FORTIFY_SOURCE=2 -Wall -Wcast-qual -fno-exceptions -std=c++11  -pedantic -Wextra -Wshadow -m32 -DNDEBUG -O3 -DNO_PREFETCH -flto   -c -o benchmark.o benchmark.cpp
g++ -pipe -O2 -pipe -O2 -D_FORTIFY_SOURCE=2 -Wall -Wcast-qual -fno-exceptions -std=c++11  -pedantic -Wextra -Wshadow -m32 -DNDEBUG -O3 -DNO_PREFETCH -flto   -c -o bitbase.o bitbase.cpp
In file included from /usr/include/features.h:399:0,
                 from /usr/include/c++/4.8.2/x86_64-redhat-linux/32/bits/os_defines.h:39,
                 from /usr/include/c++/4.8.2/x86_64-redhat-linux/32/bits/c++config.h:426,
                 from /usr/include/c++/4.8.2/iosfwd:38,
                 from /usr/include/c++/4.8.2/ios:38,
                 from /usr/include/c++/4.8.2/istream:38,
                 from /usr/include/c++/4.8.2/fstream:38,
                 from benchmark.cpp:21:
/usr/include/gnu/stubs.h:7:27: fatal error: gnu/stubs-32.h: No such file or directory
 # include <gnu/stubs-32.h>
                           ^
compilation terminated.
In file included from /usr/include/features.h:399:0,
                 from /usr/include/c++/4.8.2/x86_64-redhat-linux/32/bits/os_defines.h:39,
                 from /usr/include/c++/4.8.2/x86_64-redhat-linux/32/bits/c++config.h:426,
                 from /usr/include/c++/4.8.2/utility:68,
                 from /usr/include/c++/4.8.2/algorithm:60,
                 from bitbase.cpp:21:
/usr/include/gnu/stubs.h:7:27: fatal error: gnu/stubs-32.h: No such file or directory
 # include <gnu/stubs-32.h>
                           ^
compilation terminated.
make: *** [bitbase.o] Error 1
make: *** Waiting for unfinished jobs....
make: *** [benchmark.o] Error 1
*** Error code 2

Stop.
bmake[1]: stopped in /data/jenkins/workspace/pkgsrc-el7-trunk-x86_64/games/stockfish
*** Error code 1

Stop.
bmake: stopped in /data/jenkins/workspace/pkgsrc-el7-trunk-x86_64/games/stockfish