+ case "${usergroup_phase}" in
+ local run_cmd
+ run_cmd=run_su
+ shift
+ run_su /usr/pkg/bin/bmake all BATCH=1 DEPENDS_TARGET=/nonexistent WRKLOG=/tmp/bulklog/aide-0.6nb1/work.log
+ su pbulk -c '"$@"' make /usr/pkg/bin/bmake all BATCH=1 DEPENDS_TARGET=/nonexistent WRKLOG=/tmp/bulklog/aide-0.6nb1/work.log
=> Bootstrap dependency digest>=20211023: found digest-20220214
WARNING: [license.mk] Every package should define a LICENSE.
===> Building for aide-0.6nb1
--- all-recursive-am ---
/usr/pkg/bin/bmake  all-recursive
--- all-recursive ---
Making all in src
--- all-recursive ---
Making all in crypt
--- md.o ---
--- md5.o ---
--- md.o ---
cc -DHAVE_CONFIG_H -I. -I/home/pbulk/build/security/aide06/work/aide-0.6/src/crypt -I../.. -I/home/pbulk/build/security/aide06/work/aide-0.6/include  -I/usr/pkg/include -I/home/pbulk/build/security/aide06/work/aide-0.6 -I/home/pbulk/build/security/aide06/work/aide-0.6/src  -pipe -O2 -pipe -O2 -D_FORTIFY_SOURCE=2 -I/usr/pkg/include -c md.c
--- md5.o ---
cc -DHAVE_CONFIG_H -I. -I/home/pbulk/build/security/aide06/work/aide-0.6/src/crypt -I../.. -I/home/pbulk/build/security/aide06/work/aide-0.6/include  -I/usr/pkg/include -I/home/pbulk/build/security/aide06/work/aide-0.6 -I/home/pbulk/build/security/aide06/work/aide-0.6/src  -pipe -O2 -pipe -O2 -D_FORTIFY_SOURCE=2 -I/usr/pkg/include -c md5.c
--- rmd160.o ---
cc -DHAVE_CONFIG_H -I. -I/home/pbulk/build/security/aide06/work/aide-0.6/src/crypt -I../.. -I/home/pbulk/build/security/aide06/work/aide-0.6/include  -I/usr/pkg/include -I/home/pbulk/build/security/aide06/work/aide-0.6 -I/home/pbulk/build/security/aide06/work/aide-0.6/src  -pipe -O2 -pipe -O2 -D_FORTIFY_SOURCE=2 -I/usr/pkg/include -c rmd160.c
--- sha1.o ---
cc -DHAVE_CONFIG_H -I. -I/home/pbulk/build/security/aide06/work/aide-0.6/src/crypt -I../.. -I/home/pbulk/build/security/aide06/work/aide-0.6/include  -I/usr/pkg/include -I/home/pbulk/build/security/aide06/work/aide-0.6 -I/home/pbulk/build/security/aide06/work/aide-0.6/src  -pipe -O2 -pipe -O2 -D_FORTIFY_SOURCE=2 -I/usr/pkg/include -c sha1.c
--- tiger.o ---
cc -DHAVE_CONFIG_H -I. -I/home/pbulk/build/security/aide06/work/aide-0.6/src/crypt -I../.. -I/home/pbulk/build/security/aide06/work/aide-0.6/include  -I/usr/pkg/include -I/home/pbulk/build/security/aide06/work/aide-0.6 -I/home/pbulk/build/security/aide06/work/aide-0.6/src  -pipe -O2 -pipe -O2 -D_FORTIFY_SOURCE=2 -I/usr/pkg/include -c tiger.c
tiger.c:645:1: warning: conflicting types for built-in function 'round' [enabled by default]
 round( u64 *ra, u64 *rb, u64 *rc, u64 x, int mul )
 ^
--- enum.o ---
cc -DHAVE_CONFIG_H -I. -I/home/pbulk/build/security/aide06/work/aide-0.6/src/crypt -I../.. -I/home/pbulk/build/security/aide06/work/aide-0.6/include  -I/usr/pkg/include -I/home/pbulk/build/security/aide06/work/aide-0.6 -I/home/pbulk/build/security/aide06/work/aide-0.6/src  -pipe -O2 -pipe -O2 -D_FORTIFY_SOURCE=2 -I/usr/pkg/include -c enum.c
--- libcipher.a ---
rm -f libcipher.a
ar cru libcipher.a md.o md5.o rmd160.o sha1.o tiger.o enum.o 
ranlib libcipher.a
--- conf_yacc.c ---
--- conf_lex.c ---
--- conf_yacc.c ---
/usr/pkg/bin/bison -y -d -p conf -o conf_yacc.c conf_yacc.y
--- conf_lex.c ---
flex -Pconf -oconf_lex.c conf_lex.l
--- getopt.o ---
cc -DHAVE_CONFIG_H -I. -I/home/pbulk/build/security/aide06/work/aide-0.6/src -I.. -I/usr/pkg/include -I/home/pbulk/build/security/aide06/work/aide-0.6/include  -I/usr/pkg/include -I/home/pbulk/build/security/aide06/work/aide-0.6 -I/home/pbulk/build/security/aide06/work/aide-0.6/src  -pipe -O2 -pipe -O2 -D_FORTIFY_SOURCE=2 -I/usr/pkg/include -c getopt.c
--- getopt1.o ---
cc -DHAVE_CONFIG_H -I. -I/home/pbulk/build/security/aide06/work/aide-0.6/src -I.. -I/usr/pkg/include -I/home/pbulk/build/security/aide06/work/aide-0.6/include  -I/usr/pkg/include -I/home/pbulk/build/security/aide06/work/aide-0.6 -I/home/pbulk/build/security/aide06/work/aide-0.6/src  -pipe -O2 -pipe -O2 -D_FORTIFY_SOURCE=2 -I/usr/pkg/include -c getopt1.c
--- gnu_regex.o ---
cc -DHAVE_CONFIG_H -I. -I/home/pbulk/build/security/aide06/work/aide-0.6/src -I.. -I/usr/pkg/include -I/home/pbulk/build/security/aide06/work/aide-0.6/include  -I/usr/pkg/include -I/home/pbulk/build/security/aide06/work/aide-0.6 -I/home/pbulk/build/security/aide06/work/aide-0.6/src  -pipe -O2 -pipe -O2 -D_FORTIFY_SOURCE=2 -I/usr/pkg/include -c gnu_regex.c
--- error.o ---
cc -DHAVE_CONFIG_H -I. -I/home/pbulk/build/security/aide06/work/aide-0.6/src -I.. -I/usr/pkg/include -I/home/pbulk/build/security/aide06/work/aide-0.6/include  -I/usr/pkg/include -I/home/pbulk/build/security/aide06/work/aide-0.6 -I/home/pbulk/build/security/aide06/work/aide-0.6/src  -pipe -O2 -pipe -O2 -D_FORTIFY_SOURCE=2 -I/usr/pkg/include -c error.c
--- db.o ---
cc -DHAVE_CONFIG_H -I. -I/home/pbulk/build/security/aide06/work/aide-0.6/src -I.. -I/usr/pkg/include -I/home/pbulk/build/security/aide06/work/aide-0.6/include  -I/usr/pkg/include -I/home/pbulk/build/security/aide06/work/aide-0.6 -I/home/pbulk/build/security/aide06/work/aide-0.6/src  -pipe -O2 -pipe -O2 -D_FORTIFY_SOURCE=2 -I/usr/pkg/include -c db.c
--- gen_list.o ---
--- list.o ---
--- gen_list.o ---
cc -DHAVE_CONFIG_H -I. -I/home/pbulk/build/security/aide06/work/aide-0.6/src -I.. -I/usr/pkg/include -I/home/pbulk/build/security/aide06/work/aide-0.6/include  -I/usr/pkg/include -I/home/pbulk/build/security/aide06/work/aide-0.6 -I/home/pbulk/build/security/aide06/work/aide-0.6/src  -pipe -O2 -pipe -O2 -D_FORTIFY_SOURCE=2 -I/usr/pkg/include -c gen_list.c
--- list.o ---
cc -DHAVE_CONFIG_H -I. -I/home/pbulk/build/security/aide06/work/aide-0.6/src -I.. -I/usr/pkg/include -I/home/pbulk/build/security/aide06/work/aide-0.6/include  -I/usr/pkg/include -I/home/pbulk/build/security/aide06/work/aide-0.6 -I/home/pbulk/build/security/aide06/work/aide-0.6/src  -pipe -O2 -pipe -O2 -D_FORTIFY_SOURCE=2 -I/usr/pkg/include -c list.c
--- do_md.o ---
cc -DHAVE_CONFIG_H -I. -I/home/pbulk/build/security/aide06/work/aide-0.6/src -I.. -I/usr/pkg/include -I/home/pbulk/build/security/aide06/work/aide-0.6/include  -I/usr/pkg/include -I/home/pbulk/build/security/aide06/work/aide-0.6 -I/home/pbulk/build/security/aide06/work/aide-0.6/src  -pipe -O2 -pipe -O2 -D_FORTIFY_SOURCE=2 -I/usr/pkg/include -c do_md.c
--- base64.o ---
cc -DHAVE_CONFIG_H -I. -I/home/pbulk/build/security/aide06/work/aide-0.6/src -I.. -I/usr/pkg/include -I/home/pbulk/build/security/aide06/work/aide-0.6/include  -I/usr/pkg/include -I/home/pbulk/build/security/aide06/work/aide-0.6 -I/home/pbulk/build/security/aide06/work/aide-0.6/src  -pipe -O2 -pipe -O2 -D_FORTIFY_SOURCE=2 -I/usr/pkg/include -c base64.c
--- symboltable.o ---
--- base64.o ---
base64.c: In function 'encode_base64':
base64.c:102:3: warning: incompatible implicit declaration of built-in function 'memset' [enabled by default]
   memset((void*)outbuf,0,B64_BUF);
   ^
base64.c:165:3: warning: incompatible implicit declaration of built-in function 'memcpy' [enabled by default]
   memcpy(retbuf,outbuf,pos);
   ^
base64.c: In function 'decode_base64':
base64.c:194:3: warning: incompatible implicit declaration of built-in function 'memset' [enabled by default]
   memset(outbuf,0,sizeof(byte)*B64_BUF);
   ^
base64.c:246:3: warning: incompatible implicit declaration of built-in function 'memcpy' [enabled by default]
   memcpy(retbuf,outbuf,pos);
   ^
--- symboltable.o ---
cc -DHAVE_CONFIG_H -I. -I/home/pbulk/build/security/aide06/work/aide-0.6/src -I.. -I/usr/pkg/include -I/home/pbulk/build/security/aide06/work/aide-0.6/include  -I/usr/pkg/include -I/home/pbulk/build/security/aide06/work/aide-0.6 -I/home/pbulk/build/security/aide06/work/aide-0.6/src  -pipe -O2 -pipe -O2 -D_FORTIFY_SOURCE=2 -I/usr/pkg/include -c symboltable.c
--- compare_db.o ---
--- be.o ---
--- compare_db.o ---
cc -DHAVE_CONFIG_H -I. -I/home/pbulk/build/security/aide06/work/aide-0.6/src -I.. -I/usr/pkg/include -I/home/pbulk/build/security/aide06/work/aide-0.6/include  -I/usr/pkg/include -I/home/pbulk/build/security/aide06/work/aide-0.6 -I/home/pbulk/build/security/aide06/work/aide-0.6/src  -pipe -O2 -pipe -O2 -D_FORTIFY_SOURCE=2 -I/usr/pkg/include -c compare_db.c
--- be.o ---
cc -DHAVE_CONFIG_H -I. -I/home/pbulk/build/security/aide06/work/aide-0.6/src -I.. -I/usr/pkg/include -I/home/pbulk/build/security/aide06/work/aide-0.6/include  -I/usr/pkg/include -I/home/pbulk/build/security/aide06/work/aide-0.6 -I/home/pbulk/build/security/aide06/work/aide-0.6/src  -pipe -O2 -pipe -O2 -D_FORTIFY_SOURCE=2 -I/usr/pkg/include -c be.c
--- util.o ---
cc -DHAVE_CONFIG_H -I. -I/home/pbulk/build/security/aide06/work/aide-0.6/src -I.. -I/usr/pkg/include -I/home/pbulk/build/security/aide06/work/aide-0.6/include  -I/usr/pkg/include -I/home/pbulk/build/security/aide06/work/aide-0.6 -I/home/pbulk/build/security/aide06/work/aide-0.6/src  -pipe -O2 -pipe -O2 -D_FORTIFY_SOURCE=2 -I/usr/pkg/include -c util.c
--- aide.o ---
cc -DHAVE_CONFIG_H -I. -I/home/pbulk/build/security/aide06/work/aide-0.6/src -I.. -I/usr/pkg/include -I/home/pbulk/build/security/aide06/work/aide-0.6/include  -I/usr/pkg/include -I/home/pbulk/build/security/aide06/work/aide-0.6 -I/home/pbulk/build/security/aide06/work/aide-0.6/src  -pipe -O2 -pipe -O2 -D_FORTIFY_SOURCE=2 -I/usr/pkg/include -c aide.c
--- conf_yacc.o ---
cc -DHAVE_CONFIG_H -I. -I/home/pbulk/build/security/aide06/work/aide-0.6/src -I.. -I/usr/pkg/include -I/home/pbulk/build/security/aide06/work/aide-0.6/include  -I/usr/pkg/include -I/home/pbulk/build/security/aide06/work/aide-0.6 -I/home/pbulk/build/security/aide06/work/aide-0.6/src  -pipe -O2 -pipe -O2 -D_FORTIFY_SOURCE=2 -I/usr/pkg/include -c conf_yacc.c
--- commandconf.o ---
cc -DHAVE_CONFIG_H -I. -I/home/pbulk/build/security/aide06/work/aide-0.6/src -I.. -I/usr/pkg/include -I/home/pbulk/build/security/aide06/work/aide-0.6/include  -I/usr/pkg/include -I/home/pbulk/build/security/aide06/work/aide-0.6 -I/home/pbulk/build/security/aide06/work/aide-0.6/src  -pipe -O2 -pipe -O2 -D_FORTIFY_SOURCE=2 -I/usr/pkg/include -c commandconf.c
--- conf_lex.o ---
cc -DHAVE_CONFIG_H -I. -I/home/pbulk/build/security/aide06/work/aide-0.6/src -I.. -I/usr/pkg/include -I/home/pbulk/build/security/aide06/work/aide-0.6/include  -I/usr/pkg/include -I/home/pbulk/build/security/aide06/work/aide-0.6 -I/home/pbulk/build/security/aide06/work/aide-0.6/src  -pipe -O2 -pipe -O2 -D_FORTIFY_SOURCE=2 -I/usr/pkg/include -c conf_lex.c
--- db_file.o ---
cc -DHAVE_CONFIG_H -I. -I/home/pbulk/build/security/aide06/work/aide-0.6/src -I.. -I/usr/pkg/include -I/home/pbulk/build/security/aide06/work/aide-0.6/include  -I/usr/pkg/include -I/home/pbulk/build/security/aide06/work/aide-0.6 -I/home/pbulk/build/security/aide06/work/aide-0.6/src  -pipe -O2 -pipe -O2 -D_FORTIFY_SOURCE=2 -I/usr/pkg/include -c db_file.c
--- db_lex.o ---
cc -DHAVE_CONFIG_H -I. -I/home/pbulk/build/security/aide06/work/aide-0.6/src -I.. -I/usr/pkg/include -I/home/pbulk/build/security/aide06/work/aide-0.6/include  -I/usr/pkg/include -I/home/pbulk/build/security/aide06/work/aide-0.6 -I/home/pbulk/build/security/aide06/work/aide-0.6/src  -pipe -O2 -pipe -O2 -D_FORTIFY_SOURCE=2 -I/usr/pkg/include -c db_lex.c
--- aide ---
cc  -pipe -O2 -pipe -O2 -D_FORTIFY_SOURCE=2 -I/usr/pkg/include -static -o aide  conf_yacc.o conf_lex.o getopt.o getopt1.o gnu_regex.o  error.o db.o commandconf.o db_file.o db_lex.o gen_list.o list.o do_md.o  base64.o symboltable.o compare_db.o be.o util.o aide.o crypt/libcipher.a 
/bin/ld: cannot find -lc
collect2: error: ld returned 1 exit status
*** [aide] Error code 1

bmake[3]: stopped in /home/pbulk/build/security/aide06/work/aide-0.6/src
1 error

bmake[3]: stopped in /home/pbulk/build/security/aide06/work/aide-0.6/src
*** [all-recursive] Error code 1

bmake[2]: stopped in /home/pbulk/build/security/aide06/work/aide-0.6/src
1 error

bmake[2]: stopped in /home/pbulk/build/security/aide06/work/aide-0.6/src
*** [all-recursive] Error code 1

bmake[1]: stopped in /home/pbulk/build/security/aide06/work/aide-0.6
1 error

bmake[1]: stopped in /home/pbulk/build/security/aide06/work/aide-0.6
*** [all-recursive-am] Error code 2

bmake: stopped in /home/pbulk/build/security/aide06/work/aide-0.6
1 error

bmake: stopped in /home/pbulk/build/security/aide06/work/aide-0.6
*** Error code 2

Stop.
bmake[1]: stopped in /data/jenkins/workspace/pkgsrc-el7-trunk-x86_64/security/aide06
*** Error code 1

Stop.
bmake: stopped in /data/jenkins/workspace/pkgsrc-el7-trunk-x86_64/security/aide06