+ case "${usergroup_phase}" in + local run_cmd + run_cmd=run_su + shift + run_su /usr/pkg/bin/bmake all BATCH=1 DEPENDS_TARGET=/nonexistent WRKLOG=/tmp/bulklog/sleepto-1.1/work.log + su pbulk -c '"$@"' make /usr/pkg/bin/bmake all BATCH=1 DEPENDS_TARGET=/nonexistent WRKLOG=/tmp/bulklog/sleepto-1.1/work.log => Bootstrap dependency digest>=20211023: found digest-20220214 ===> Building for sleepto-1.1 --- sleepto.o --- --- parsetime.o --- --- sleepto.o --- cc -pipe -O2 -pipe -O2 -D_FORTIFY_SOURCE=2 -c sleepto.c --- parsetime.o --- cc -pipe -O2 -pipe -O2 -D_FORTIFY_SOURCE=2 -c parsetime.c parsetime.c:50:20: fatal error: tzfile.h: No such file or directory #include <tzfile.h> ^ compilation terminated. --- sleepto.o --- sleepto.c:18:26: error: expected ';', ',' or ')' before '__unused' report_request(int signo __unused) ^ sleepto.c: In function 'main': sleepto.c:52:9: error: 'SIGINFO' undeclared (first use in this function) signal(SIGINFO, report_request); ^ sleepto.c:52:9: note: each undeclared identifier is reported only once for each function it appears in sleepto.c:52:18: error: 'report_request' undeclared (first use in this function) signal(SIGINFO, report_request); ^ *** [sleepto.o] Error code 1 bmake: stopped in /home/pbulk/build/misc/sleepto/work/sleepto-1.1 --- parsetime.o --- *** [parsetime.o] Error code 1 bmake: stopped in /home/pbulk/build/misc/sleepto/work/sleepto-1.1 2 errors bmake: stopped in /home/pbulk/build/misc/sleepto/work/sleepto-1.1 *** Error code 2 Stop. bmake[1]: stopped in /data/jenkins/workspace/pkgsrc-el7-trunk-x86_64/misc/sleepto *** Error code 1 Stop. bmake: stopped in /data/jenkins/workspace/pkgsrc-el7-trunk-x86_64/misc/sleepto