===> Building for deforaos-libdatabase-0.1.0nb6
./pkgconfig.sh -P "/opt/pkg" -- "libDatabase.pc"
sed -e s;@PACKAGE@;libDatabase;g -e s;@VERSION@;0.1.0;g -e s;@PREFIX@;/opt/pkg;g -e s;@BINDIR@;/opt/pkg/bin;g -e s;@DATADIR@;/opt/pkg/share;g -e s;@INCLUDEDIR@;/opt/pkg/include;g -e s;@LIBDIR@;/usr/local/lib;g -e s;@LIBEXECDIR@;/opt/pkg/libexec;g -e s;@MANDIR@;/opt/pkg/share/man;g -e s;@PWD@;/Users/pbulk/build/databases/deforaos-libdatabase/work/libDatabase-0.1.0/data;g -e s;@RPATH@;-Wl,-rpath,${libdir};g -e s;@SYSCONFDIR@;/opt/pkg/etc;g -- libDatabase.pc.in
../tools/subst.sh -P "/opt/pkg" -- "database.xml"
sed -e s;@PACKAGE@;libDatabase;g -e s;@VERSION@;0.1.0;g -e s;@PREFIX@;/opt/pkg;g -e s;@BINDIR@;/opt/pkg/bin;g -e s;@DATADIR@;/opt/pkg/share;g -e s;@DATE@;November 13, 2024;g -e s;@INCLUDEDIR@;/opt/pkg/include;g -e s;@LDSO@;/libexec/ld.elf_so;g -e s;@LIBDIR@;/usr/local/lib;g -e s;@LIBEXECDIR@;/opt/pkg/libexec;g -e s;@MANDIR@;/opt/pkg/share/man;g -e s;@PWD@;/Users/pbulk/build/databases/deforaos-libdatabase/work/libDatabase-0.1.0/doc;g -e s;@SYSCONFDIR@;/opt/pkg/etc;g -- database.xml.in
./gtkdoc.sh -P "/opt/pkg" -- "gtkdoc/libDatabase.types"
gtkdoc-scan --module=libDatabase --source-dir=include --output-dir=/Users/pbulk/build/databases/deforaos-libdatabase/work/libDatabase-0.1.0/doc/gtkdoc
/opt/pkg/share/gtk-doc/python/gtkdoc/scan.py:44: SyntaxWarning: invalid escape sequence '\s'
  VAR_TYPE_MODIFIER = '(?:' + '|'.join([t + '\s+' for t in TYPE_MODIFIERS]) + ')*'
/opt/pkg/share/gtk-doc/python/gtkdoc/scan.py:45: SyntaxWarning: invalid escape sequence '\s'
  RET_TYPE_MODIFIER = '(?:' + '|'.join([t + '\s+' for t in TYPE_MODIFIERS + ['G_CONST_RETURN']]) + ')*'
/opt/pkg/share/gtk-doc/python/gtkdoc/scan.py:238: SyntaxWarning: invalid escape sequence '\('
  ignore_decorators = '|' + options.ignore_decorators.replace('()', '\(\w*\)')
/opt/pkg/share/gtk-doc/python/gtkdoc/scan.py:239: SyntaxWarning: invalid escape sequence '\s'
  optional_decorators_regex = '(?:\s+(?:%s))?' % ignore_decorators[1:]
/opt/pkg/share/gtk-doc/python/gtkdoc/scan.py:487: SyntaxWarning: invalid escape sequence '\('
  ignore_decorators = '|' + options.ignore_decorators.replace('()', '\(\w*\)')
/opt/pkg/share/gtk-doc/python/gtkdoc/scan.py:488: SyntaxWarning: invalid escape sequence '\s'
  optional_decorators_regex = '(?:\s+(?:%s))?' % ignore_decorators[1:]
./docbook.sh -P "/opt/pkg" -- "database.1"
xsltproc --nonet --xinclude -o database.1 http://docbook.sourceforge.net/release/xsl/current/manpages/docbook.xsl database.xml
Note: Writing database.1
./docbook.sh -P "/opt/pkg" -- "database.html"
xsltproc --nonet --xinclude --param custom.css.source "database.css.xml" --param generate.css.header 1 -o database.html http://docbook.sourceforge.net/release/xsl/current/xhtml/docbook.xsl database.xml
./gtkdoc.sh -P "/opt/pkg" -- "gtkdoc/tmpl.stamp"
gtkdoc-mktmpl --module=libDatabase --output-dir=tmpl
./gtkdoc.sh: line 53: gtkdoc-mktmpl: command not found
gtkdoc.sh: gtkdoc/tmpl.stamp: Could not create documentation
./gtkdoc.sh -P "/opt/pkg" -- "gtkdoc/xml.stamp"
gtkdoc-mkdb --module=libDatabase --output-dir=xml --output-format=xml --tmpl-dir=tmpl
unknown:0: warning: Value descriptions for DatabaseType are missing in source code comment block.
./gtkdoc.sh -P "/opt/pkg" -- "gtkdoc/html.stamp"
mkdir -m 0755 -p -- gtkdoc/html
gtkdoc-mkhtml --path /Users/pbulk/build/databases/deforaos-libdatabase/work/libDatabase-0.1.0 libDatabase ../libDatabase-docs.xml
warning: failed to load external entity "../xml/annotation-glossary.xml"
gtkdoc-fixxref --module=libDatabase --module-dir=html --html-dir=/opt/pkg/share/gtk-doc/html
html/api-index-full.html:59: warning: no link for: "libDatabase-engine" -> (engine).
html/api-index-full.html:77: warning: no link for: "get-last-id" -> (get_last_id).
html/api-index-full.html:101: warning: no link for: "libDatabase-statement" -> (statement).
html/api-index-full.html:105: warning: no link for: "databasestatement-delete" -> (databasestatement_delete).
html/api-index-full.html:109: warning: no link for: "statement-delete" -> (statement_delete).
html/api-index-full.html:113: warning: no link for: "databasestatement-get-database" -> (databasestatement_get_database).
html/api-index-full.html:117: warning: no link for: "databasestatement-new" -> (databasestatement_new).
html/api-index-full.html:121: warning: no link for: "statement-new" -> (statement_new).
html/api-index-full.html:125: warning: no link for: "databasestatement-query" -> (databasestatement_query).
html/api-index-full.html:129: warning: no link for: "statement-query" -> (statement_query).
html/api-index-full.html:133: warning: no link for: "databasestatement-queryv" -> (databasestatement_queryv).
html/libDatabase-database.html:122: warning: no link for: "Config" -> (<span class="type">Config</span>).
cc -D PREFIX=\"/opt/pkg\" -I ../../include  -fPIC -pipe -Os -I/opt/pkg/include -I/opt/pkg/include/ncurses `pkg-config --cflags libSystem` -o pdo.o -c pdo.c
cc -I ../../include  -I `pg_config --includedir` -fPIC -pipe -Os -I/opt/pkg/include -I/opt/pkg/include/ncurses `pkg-config --cflags libSystem` -o pgsql.o -c pgsql.c
pgsql.c:333:61: warning: passing 'char **' to parameter of type 'const char *const *' discards qualifiers in nested pointer types [-Wincompatible-pointer-types-discards-qualifiers]
        res = PQexecPrepared(pgsql->handle, statement->query, cnt, v, NULL,
                                                                   ^
/Users/pbulk/build/databases/deforaos-libdatabase/work/.buildlink/include/libpq-fe.h:435:28: note: passing argument to parameter 'paramValues' here
                                                                const char *const *paramValues,
                                                                                   ^
1 warning generated.
cc -I ../../include  -I `pg_config --includedir` -fPIC -pipe -Os -I/opt/pkg/include -I/opt/pkg/include/ncurses `pkg-config --cflags libSystem` -o pgsqlpool.o -c pgsqlpool.c
In file included from pgsqlpool.c:34:
./pgsql.c:333:61: warning: passing 'char **' to parameter of type 'const char *const *' discards qualifiers in nested pointer types [-Wincompatible-pointer-types-discards-qualifiers]
        res = PQexecPrepared(pgsql->handle, statement->query, cnt, v, NULL,
                                                                   ^
/Users/pbulk/build/databases/deforaos-libdatabase/work/.buildlink/include/libpq-fe.h:435:28: note: passing argument to parameter 'paramValues' here
                                                                const char *const *paramValues,
                                                                                   ^
1 warning generated.
cc -I ../../include  -fPIC -pipe -Os -I/opt/pkg/include -I/opt/pkg/include/ncurses `pkg-config --cflags sqlite libSystem` -o sqlite2.o -c sqlite2.c
cc -I ../../include  -fPIC -pipe -Os -I/opt/pkg/include -I/opt/pkg/include/ncurses `pkg-config --cflags sqlite3 libSystem` -o sqlite3.o -c sqlite3.c
cc -I ../../include  -fPIC -pipe -Os -I/opt/pkg/include -I/opt/pkg/include/ncurses `pkg-config --cflags libSystem` -o template.o -c template.c
cc -dynamiclib -o pdo.dylib pdo.o  -L/opt/pkg/lib `pkg-config --libs libSystem`
Undefined symbols for architecture arm64:
  "_free", referenced from:
      __pdo_init in pdo.o
  "_strchr", referenced from:
      __pdo_init in pdo.o
  "_strcmp", referenced from:
      __pdo_init in pdo.o
  "_strdup", referenced from:
      __pdo_init in pdo.o
  "_strlen", referenced from:
      __pdo_init in pdo.o
  "_strncmp", referenced from:
      __pdo_init in pdo.o
ld: symbol(s) not found for architecture arm64
clang: error: linker command failed with exit code 1 (use -v to see invocation)
*** [pdo.dylib] Error code 1

bmake[2]: stopped making "all" in /Users/pbulk/build/databases/deforaos-libdatabase/work/libDatabase-0.1.0/src/engines
bmake[2]: 1 error

bmake[2]: stopped making "all" in /Users/pbulk/build/databases/deforaos-libdatabase/work/libDatabase-0.1.0/src/engines
*** [subdirs] Error code 2

bmake[1]: stopped making "all" in /Users/pbulk/build/databases/deforaos-libdatabase/work/libDatabase-0.1.0/src
bmake[1]: 1 error

bmake[1]: stopped making "all" in /Users/pbulk/build/databases/deforaos-libdatabase/work/libDatabase-0.1.0/src
*** [subdirs] Error code 2

bmake: stopped making "all" in /Users/pbulk/build/databases/deforaos-libdatabase/work/libDatabase-0.1.0
bmake: 1 error

bmake: stopped making "all" in /Users/pbulk/build/databases/deforaos-libdatabase/work/libDatabase-0.1.0
*** Error code 2

Stop.
bmake[1]: stopped making "all" in /Volumes/data/jenkins/workspace/pkgsrc-macos-trunk-arm64/databases/deforaos-libdatabase
*** Error code 1

Stop.
bmake: stopped making "all" in /Volumes/data/jenkins/workspace/pkgsrc-macos-trunk-arm64/databases/deforaos-libdatabase