===> Building for wired-notify-0.10.6
   Compiling libc v0.2.126
   Compiling autocfg v1.0.1
   Compiling pkg-config v0.3.19
   Compiling serde v1.0.129
   Compiling cfg-if v1.0.0
   Compiling toml v0.5.8
   Compiling smallvec v1.8.0
   Compiling bitflags v1.3.2
   Compiling heck v0.4.0
   Compiling cfg-expr v0.9.1
   Compiling version-compare v0.1.0
   Compiling proc-macro2 v1.0.28
   Compiling system-deps v6.0.1
   Compiling unicode-xid v0.2.2
   Compiling quote v1.0.9
   Compiling syn v1.0.75
   Compiling once_cell v1.8.0
   Compiling version_check v0.9.3
   Compiling glib-sys v0.15.5
   Compiling crossbeam-utils v0.8.11
   Compiling memoffset v0.6.4
   Compiling futures-core v0.3.19
   Compiling crc32fast v1.2.1
   Compiling adler v1.0.2
   Compiling proc-macro-error-attr v1.0.4
   Compiling thiserror-impl v1.0.28
   Compiling gobject-sys v0.15.5
   Compiling lazy_static v1.4.0
   Compiling crossbeam-epoch v0.9.5
   Compiling adler32 v1.2.0
   Compiling bytemuck v1.9.1
   Compiling futures-task v0.3.19
   Compiling foreign-types-shared v0.1.1
   Compiling core-foundation-sys v0.8.6
   Compiling foreign-types v0.3.2
   Compiling proc-macro-error v1.0.4
   Compiling num-traits v0.2.14
   Compiling anyhow v1.0.51
   Compiling scopeguard v1.1.0
   Compiling rayon-core v1.9.1
   Compiling log v0.4.14
   Compiling futures-util v0.3.19
   Compiling thiserror v1.0.28
   Compiling x11 v2.18.2
   Compiling futures-channel v0.3.19
   Compiling slab v0.4.4
   Compiling pin-project-lite v0.2.7
   Compiling core-foundation-sys v0.7.0
   Compiling pin-utils v0.1.0
   Compiling proc-macro-crate v1.0.0
   Compiling crossbeam-deque v0.8.1
   Compiling core-foundation v0.9.1
   Compiling crossbeam-channel v0.5.1
   Compiling miniz_oxide v0.5.1
   Compiling cairo-sys-rs v0.15.1
   Compiling pango-sys v0.15.1
   Compiling rayon v1.5.1
   Compiling num-integer v0.1.44
   Compiling malloc_buf v0.0.6
   Compiling num_cpus v1.13.0
   Compiling serde_derive v1.0.129
   Compiling unicode-general-category v0.4.0
   Compiling objc v0.2.7
   Compiling core-graphics-types v0.1.1
   Compiling glib-macros v0.15.3
   Compiling futures-executor v0.3.19
   Compiling libdbus-sys v0.2.2
   Compiling miniz_oxide v0.4.4
   Compiling ttf-parser v0.15.0
   Compiling weezl v0.1.5
   Compiling either v1.6.1
   Compiling glib v0.15.5
   Compiling core-foundation v0.7.0
   Compiling deflate v1.0.0
   Compiling pangocairo-sys v0.15.1
   Compiling num-rational v0.3.2
   Compiling num-iter v0.1.42
   Compiling memmap2 v0.5.3
   Compiling byteorder v1.4.3
   Compiling matches v0.1.9
   Compiling float-cmp v0.9.0
   Compiling siphasher v0.3.10
   Compiling arrayvec v0.7.2
   Compiling xmlparser v0.13.3
   Compiling unicode-script v0.5.4
   Compiling unicode-bidi-mirroring v0.1.0
   Compiling base64 v0.13.0
   Compiling color_quant v1.1.0
   Compiling block v0.1.6
   Compiling unicode-ccc v0.1.2
   Compiling rustybuzz v0.5.0
   Compiling cocoa-foundation v0.1.0
   Compiling gif v0.11.3
   Compiling roxmltree v0.14.1
   Compiling kurbo v0.8.3
   Compiling svgtypes v0.8.0
   Compiling data-url v0.1.1
   Compiling deflate v0.8.6
   Compiling fontdb v0.9.1
   Compiling png v0.17.5
   Compiling core-graphics v0.19.2
   Compiling jpeg-decoder v0.1.22
   Compiling core-graphics v0.22.2
   Compiling flate2 v1.0.23
   Compiling simplecss v0.2.1
   Compiling safe_arch v0.5.2
   Compiling rgb v0.8.32
   Compiling miniz_oxide v0.3.7
   Compiling fsevent-sys v2.0.1
   Compiling unicode-bidi v0.3.7
   Compiling xmlwriter v0.1.0
   Compiling unicode-vo v0.1.0
   Compiling cty v0.2.2
   Compiling arrayref v0.3.6
   Compiling arrayvec v0.5.2
   Compiling same-file v1.0.6
   Compiling serde_json v1.0.81
   Compiling pico-args v0.4.2
   Compiling rctree v0.4.0
   Compiling cfg-if v0.1.10
   Compiling winit v0.26.0
   Compiling core-video-sys v0.1.4
   Compiling usvg v0.22.0
   Compiling walkdir v2.3.2
   Compiling tiny-skia v0.6.3
   Compiling raw-window-handle v0.4.2
   Compiling fsevent v0.4.0
   Compiling png v0.16.8
   Compiling svgfilters v0.4.0
   Compiling cocoa v0.24.0
   Compiling tiff v0.6.1
   Compiling dbus v0.9.5
   Compiling pango v0.15.2
   Compiling cairo-rs v0.15.1
   Compiling iana-time-zone v0.1.60
   Compiling filetime v0.2.15
   Compiling instant v0.1.10
   Compiling scoped_threadpool v0.1.9
   Compiling itoa v1.0.2
   Compiling jpeg-decoder v0.2.4
   Compiling ryu v1.0.10
   Compiling dispatch v0.2.0
   Compiling unicode-width v0.1.8
   Compiling getopts v0.2.21
   Compiling resvg v0.22.0
   Compiling image v0.23.14
   Compiling notify v4.0.17
   Compiling chrono v0.4.34
   Compiling pangocairo v0.15.1
   Compiling dbus-crossroads v0.5.0
   Compiling ron v0.7.0
   Compiling wired_derive v0.1.0 (/Users/pbulk/build/x11/wired-notify/work/wired-notify-0.10.6/wired_derive)
   Compiling xdg v2.2.0
   Compiling wired v0.10.6 (/Users/pbulk/build/x11/wired-notify/work/wired-notify-0.10.6)
error[E0432]: unresolved import `winit::platform::unix`
  --> src/rendering/window.rs:6:15
   |
6  |     platform::unix::{WindowBuilderExtUnix, WindowExtUnix, XWindowType},
   |               ^^^^ could not find `unix` in `platform`
   |
note: found an item that was configured out
  --> /Users/pbulk/build/x11/wired-notify/work/vendor/winit-0.26.0/src/platform/mod.rs:21:9
   |
21 | pub mod unix;
   |         ^^^^

error[E0432]: unresolved import `winit::platform::unix`
  --> src/main.rs:24:15
   |
24 |     platform::unix::EventLoopExtUnix,
   |               ^^^^ could not find `unix` in `platform`
   |
note: found an item that was configured out
  --> /Users/pbulk/build/x11/wired-notify/work/vendor/winit-0.26.0/src/platform/mod.rs:21:9
   |
21 | pub mod unix;
   |         ^^^^

error[E0432]: unresolved import `winit::platform::unix`
  --> src/maths_utility.rs:7:22
   |
7  | use winit::platform::unix::WindowExtUnix;
   |                      ^^^^ could not find `unix` in `platform`
   |
note: found an item that was configured out
  --> /Users/pbulk/build/x11/wired-notify/work/vendor/winit-0.26.0/src/platform/mod.rs:21:9
   |
21 | pub mod unix;
   |         ^^^^

error[E0432]: unresolved import `winit::platform::unix`
   --> src/maths_utility.rs:602:26
    |
602 |     use winit::platform::unix::WindowExtUnix;
    |                          ^^^^ could not find `unix` in `platform`
    |
note: found an item that was configured out
   --> /Users/pbulk/build/x11/wired-notify/work/vendor/winit-0.26.0/src/platform/mod.rs:21:9
    |
21  | pub mod unix;
    |         ^^^^

error[E0599]: no method named `xlib_display` found for reference `&Window` in the current scope
   --> src/maths_utility.rs:606:25
    |
606 |             base_window.xlib_display().unwrap() as _,
    |                         ^^^^^^^^^^^^ method not found in `&Window`

error[E0599]: no method named `xlib_window` found for reference `&Window` in the current scope
   --> src/maths_utility.rs:607:25
    |
607 |             base_window.xlib_window().unwrap() as _,
    |                         ^^^^^^^^^^^
    |
help: there is a method `ns_window` with a similar name
    |
607 |             base_window.ns_window().unwrap() as _,
    |                         ~~~~~~~~~

error[E0599]: no method named `xlib_display` found for reference `&Window` in the current scope
   --> src/maths_utility.rs:621:31
    |
621 |     let display = base_window.xlib_display().unwrap();
    |                               ^^^^^^^^^^^^ method not found in `&Window`

error[E0599]: no method named `xlib_display` found for reference `&Window` in the current scope
   --> src/maths_utility.rs:671:31
    |
671 |     let display = base_window.xlib_display().unwrap();
    |                               ^^^^^^^^^^^^ method not found in `&Window`

error[E0599]: no method named `xlib_display` found for struct `Window` in the current scope
  --> src/rendering/window.rs:94:14
   |
92 |           let xlib_display = manager
   |  ____________________________-
93 | |             .base_window
94 | |             .xlib_display()
   | |             -^^^^^^^^^^^^ method not found in `Window`
   | |_____________|
   |

error[E0599]: no method named `with_x11_window_type` found for struct `WindowBuilder` in the current scope
   --> src/rendering/window.rs:117:14
    |
115 |           let winit = WindowBuilder::new()
    |  _____________________-
116 | |             .with_inner_size(PhysicalSize { width, height })
117 | |             .with_x11_window_type(vec![XWindowType::Notification, XWindowType::Utility])
    | |_____________-^^^^^^^^^^^^^^^^^^^^
    |
help: there is a method `with_window_icon` with a similar name
    |
117 |             .with_window_icon(vec![XWindowType::Notification, XWindowType::Utility])
    |              ~~~~~~~~~~~~~~~~

error[E0599]: no function or associated item named `new_x11` found for struct `EventLoop<_>` in the current scope
   --> src/main.rs:101:37
    |
101 |     let mut event_loop = EventLoop::new_x11().expect("Couldn't create an X11 event loop.");
    |                                     ^^^^^^^ function or associated item not found in `EventLoop<_>`
    |
note: if you're trying to build a new `EventLoop<_>` consider using one of the following associated functions:
      EventLoop::<()>::new
      EventLoop::<T>::with_user_event
   --> /Users/pbulk/build/x11/wired-notify/work/vendor/winit-0.26.0/src/event_loop.rs:119:5
    |
119 |     pub fn new() -> EventLoop<()> {
    |     ^^^^^^^^^^^^^^^^^^^^^^^^^^^^^
...
132 |     pub fn with_user_event() -> EventLoop<T> {
    |     ^^^^^^^^^^^^^^^^^^^^^^^^^^^^^^^^^^^^^^^^

warning: unused import: `platform::run_return::EventLoopExtRunReturn`
  --> src/main.rs:23:5
   |
23 |     platform::run_return::EventLoopExtRunReturn,
   |     ^^^^^^^^^^^^^^^^^^^^^^^^^^^^^^^^^^^^^^^^^^^
   |
   = note: `#[warn(unused_imports)]` on by default

Some errors have detailed explanations: E0432, E0599.
For more information about an error, try `rustc --explain E0432`.
warning: `wired` (bin "wired") generated 1 warning
error: could not compile `wired` (bin "wired") due to 11 previous errors; 1 warning emitted
*** Error code 101

Stop.
bmake[1]: stopped making "all" in /Volumes/data/jenkins/workspace/pkgsrc-macos-trunk-arm64/x11/wired-notify
*** Error code 1

Stop.
bmake: stopped making "all" in /Volumes/data/jenkins/workspace/pkgsrc-macos-trunk-arm64/x11/wired-notify