=> Bootstrap dependency digest>=20211023: found digest-20220214
===> Building for mysql-client-5.6.51nb3
[  0%] Built target INFO_SRC
[  0%] Built target INFO_BIN
[  1%] Building C object extra/libevent/CMakeFiles/event_core.dir/buffer.c.o
[  1%] Building C object extra/libevent/CMakeFiles/event_core.dir/bufferevent.c.o
[  1%] Building C object extra/libevent/CMakeFiles/event_core.dir/bufferevent_filter.c.o
[  2%] Building C object extra/libevent/CMakeFiles/event_core.dir/bufferevent_pair.c.o
[  2%] Building C object extra/libevent/CMakeFiles/event_core.dir/bufferevent_ratelim.c.o
[  2%] Building C object extra/libevent/CMakeFiles/event_core.dir/bufferevent_sock.c.o
[  3%] Building C object extra/libevent/CMakeFiles/event_core.dir/event.c.o
[  3%] Building C object extra/libevent/CMakeFiles/event_core.dir/evmap.c.o
[  3%] Building C object extra/libevent/CMakeFiles/event_core.dir/evthread.c.o
[  4%] Building C object extra/libevent/CMakeFiles/event_core.dir/evutil.c.o
[  4%] Building C object extra/libevent/CMakeFiles/event_core.dir/evutil_rand.c.o
[  4%] Building C object extra/libevent/CMakeFiles/event_core.dir/evutil_time.c.o
[  4%] Building C object extra/libevent/CMakeFiles/event_core.dir/listener.c.o
[  5%] Building C object extra/libevent/CMakeFiles/event_core.dir/log.c.o
[  5%] Building C object extra/libevent/CMakeFiles/event_core.dir/signal.c.o
[  5%] Building C object extra/libevent/CMakeFiles/event_core.dir/strlcpy.c.o
[  6%] Building C object extra/libevent/CMakeFiles/event_core.dir/select.c.o
[  6%] Building C object extra/libevent/CMakeFiles/event_core.dir/poll.c.o
[  6%] Building C object extra/libevent/CMakeFiles/event_core.dir/kqueue.c.o
[  7%] Building C object extra/libevent/CMakeFiles/event_core.dir/evthread_pthread.c.o
[  7%] Linking C static library lib/libevent_core.a
[  7%] Built target event_core
[  7%] Building C object extra/libevent/CMakeFiles/event_extra.dir/buffer.c.o
[  8%] Building C object extra/libevent/CMakeFiles/event_extra.dir/bufferevent.c.o
[  8%] Building C object extra/libevent/CMakeFiles/event_extra.dir/bufferevent_filter.c.o
[  8%] Building C object extra/libevent/CMakeFiles/event_extra.dir/bufferevent_pair.c.o
[  8%] Building C object extra/libevent/CMakeFiles/event_extra.dir/bufferevent_ratelim.c.o
[  9%] Building C object extra/libevent/CMakeFiles/event_extra.dir/bufferevent_sock.c.o
[  9%] Building C object extra/libevent/CMakeFiles/event_extra.dir/event.c.o
[  9%] Building C object extra/libevent/CMakeFiles/event_extra.dir/evmap.c.o
[ 10%] Building C object extra/libevent/CMakeFiles/event_extra.dir/evthread.c.o
[ 10%] Building C object extra/libevent/CMakeFiles/event_extra.dir/evutil.c.o
[ 10%] Building C object extra/libevent/CMakeFiles/event_extra.dir/evutil_rand.c.o
[ 11%] Building C object extra/libevent/CMakeFiles/event_extra.dir/evutil_time.c.o
[ 11%] Building C object extra/libevent/CMakeFiles/event_extra.dir/listener.c.o
[ 11%] Building C object extra/libevent/CMakeFiles/event_extra.dir/log.c.o
[ 11%] Building C object extra/libevent/CMakeFiles/event_extra.dir/signal.c.o
[ 12%] Building C object extra/libevent/CMakeFiles/event_extra.dir/strlcpy.c.o
[ 12%] Building C object extra/libevent/CMakeFiles/event_extra.dir/select.c.o
[ 12%] Building C object extra/libevent/CMakeFiles/event_extra.dir/poll.c.o
[ 13%] Building C object extra/libevent/CMakeFiles/event_extra.dir/kqueue.c.o
[ 13%] Building C object extra/libevent/CMakeFiles/event_extra.dir/evthread_pthread.c.o
[ 13%] Building C object extra/libevent/CMakeFiles/event_extra.dir/event_tagging.c.o
[ 14%] Building C object extra/libevent/CMakeFiles/event_extra.dir/http.c.o
[ 14%] Building C object extra/libevent/CMakeFiles/event_extra.dir/evdns.c.o
[ 14%] Building C object extra/libevent/CMakeFiles/event_extra.dir/evrpc.c.o
[ 15%] Linking C static library lib/libevent_extra.a
[ 15%] Built target event_extra
[ 15%] Building C object extra/libevent/CMakeFiles/event.dir/buffer.c.o
[ 15%] Building C object extra/libevent/CMakeFiles/event.dir/bufferevent.c.o
[ 16%] Building C object extra/libevent/CMakeFiles/event.dir/bufferevent_filter.c.o
[ 16%] Building C object extra/libevent/CMakeFiles/event.dir/bufferevent_pair.c.o
[ 16%] Building C object extra/libevent/CMakeFiles/event.dir/bufferevent_ratelim.c.o
[ 17%] Building C object extra/libevent/CMakeFiles/event.dir/bufferevent_sock.c.o
[ 17%] Building C object extra/libevent/CMakeFiles/event.dir/event.c.o
[ 17%] Building C object extra/libevent/CMakeFiles/event.dir/evmap.c.o
[ 18%] Building C object extra/libevent/CMakeFiles/event.dir/evthread.c.o
[ 18%] Building C object extra/libevent/CMakeFiles/event.dir/evutil.c.o
[ 18%] Building C object extra/libevent/CMakeFiles/event.dir/evutil_rand.c.o
[ 19%] Building C object extra/libevent/CMakeFiles/event.dir/evutil_time.c.o
[ 19%] Building C object extra/libevent/CMakeFiles/event.dir/listener.c.o
[ 19%] Building C object extra/libevent/CMakeFiles/event.dir/log.c.o
[ 19%] Building C object extra/libevent/CMakeFiles/event.dir/signal.c.o
[ 20%] Building C object extra/libevent/CMakeFiles/event.dir/strlcpy.c.o
[ 20%] Building C object extra/libevent/CMakeFiles/event.dir/select.c.o
[ 20%] Building C object extra/libevent/CMakeFiles/event.dir/poll.c.o
[ 21%] Building C object extra/libevent/CMakeFiles/event.dir/kqueue.c.o
[ 21%] Building C object extra/libevent/CMakeFiles/event.dir/evthread_pthread.c.o
[ 21%] Building C object extra/libevent/CMakeFiles/event.dir/event_tagging.c.o
[ 22%] Building C object extra/libevent/CMakeFiles/event.dir/http.c.o
[ 22%] Building C object extra/libevent/CMakeFiles/event.dir/evdns.c.o
[ 22%] Building C object extra/libevent/CMakeFiles/event.dir/evrpc.c.o
[ 22%] Linking C static library lib/libevent.a
[ 22%] Built target event
[ 23%] Building C object strings/CMakeFiles/strings.dir/bchange.c.o
In file included from /Users/pbulk/build/databases/mysql56-client/work/mysql-5.6.51/strings/bchange.c:39:
/Users/pbulk/build/databases/mysql56-client/work/mysql-5.6.51/include/my_global.h:186:6: error: Building FAT binary for an unknown architecture.
#    error Building FAT binary for an unknown architecture.
     ^
1 error generated.
gmake[2]: *** [strings/CMakeFiles/strings.dir/build.make:76: strings/CMakeFiles/strings.dir/bchange.c.o] Error 1
gmake[1]: *** [CMakeFiles/Makefile2:699: strings/CMakeFiles/strings.dir/all] Error 2
gmake: *** [Makefile:156: all] Error 2
*** Error code 2

Stop.
bmake[1]: stopped making "all" in /Volumes/data/jenkins/workspace/pkgsrc-macos-trunk-arm64/databases/mysql56-client
*** Error code 1

Stop.
bmake: stopped making "all" in /Volumes/data/jenkins/workspace/pkgsrc-macos-trunk-arm64/databases/mysql56-client