=> Bootstrap dependency digest>=20211023: found digest-20220214
===> Building for mate-polkit-1.26.1nb7
/opt/pkg/bin/gmake  all-recursive
gmake[1]: Entering directory '/Users/pbulk/build/security/mate-polkit/work/mate-polkit-1.26.1'
Making all in po
gmake[2]: Entering directory '/Users/pbulk/build/security/mate-polkit/work/mate-polkit-1.26.1/po'
gmake[2]: Nothing to be done for 'all'.
gmake[2]: Leaving directory '/Users/pbulk/build/security/mate-polkit/work/mate-polkit-1.26.1/po'
Making all in src
gmake[2]: Entering directory '/Users/pbulk/build/security/mate-polkit/work/mate-polkit-1.26.1/src'
  CC       polkit_mate_authentication_agent_1-polkitmatelistener.o
  CC       polkit_mate_authentication_agent_1-polkitmateauthenticator.o
polkitmateauthenticator.c:30:10: fatal error: 'gdk/gdkx.h' file not found
#include <gdk/gdkx.h>
         ^~~~~~~~~~~~
1 error generated.
gmake[2]: *** [Makefile:566: polkit_mate_authentication_agent_1-polkitmateauthenticator.o] Error 1
gmake[2]: Leaving directory '/Users/pbulk/build/security/mate-polkit/work/mate-polkit-1.26.1/src'
gmake[1]: *** [Makefile:451: all-recursive] Error 1
gmake[1]: Leaving directory '/Users/pbulk/build/security/mate-polkit/work/mate-polkit-1.26.1'
gmake: *** [Makefile:383: all] Error 2
*** Error code 2

Stop.
bmake[1]: stopped in /Volumes/data/jenkins/workspace/pkgsrc-macos-trunk-arm64/security/mate-polkit
*** Error code 1

Stop.
bmake: stopped in /Volumes/data/jenkins/workspace/pkgsrc-macos-trunk-arm64/security/mate-polkit