=> Bootstrap dependency digest>=20211023: found digest-20220214
===> Building for artha-1.0.5nb7
/opt/pkg/bin/gmake  all-recursive
gmake[1]: Entering directory '/Users/pbulk/build/textproc/artha/work/artha-1.0.5'
Making all in data
gmake[2]: Entering directory '/Users/pbulk/build/textproc/artha/work/artha-1.0.5/data'
gmake[2]: Nothing to be done for 'all'.
gmake[2]: Leaving directory '/Users/pbulk/build/textproc/artha/work/artha-1.0.5/data'
Making all in src
gmake[2]: Entering directory '/Users/pbulk/build/textproc/artha/work/artha-1.0.5/src'
clang -DHAVE_CONFIG_H -I. -I..   -DPNG_NO_ASSEMBLER_CODE -I/opt/pkg/include -I/opt/pkg/include/glib-2.0 -I/opt/pkg/include/gio-unix-2.0 -I/opt/pkg/lib/glib-2.0/include -I/opt/pkg/include/freetype2 -I/opt/pkg/include/harfbuzz -Wall -Wextra -std=c99 -pedantic -Wno-unused-parameter -fstrict-aliasing -Wno-missing-field-initializers -I/opt/pkg/include/gtk-2.0 -I/opt/pkg/lib/gtk-2.0/include -I/opt/pkg/include/pango-1.0 -I/opt/pkg/include/fribidi -I/opt/pkg/include -D_REENTRANT -I/opt/pkg/include/harfbuzz -I/opt/pkg/include/atk-1.0 -I/opt/pkg/include/cairo -I/opt/pkg/include/freetype2 -I/opt/pkg/include/pixman-1 -I/opt/pkg/include/gdk-pixbuf-2.0 -I/opt/pkg/include/libpng16 -I/opt/pkg/include/glib-2.0 -I/opt/pkg/lib/glib-2.0/include -DGTK_DISABLE_DEPRECATED=1 -DGDK_DISABLE_DEPRECATED=1 -DGDK_PIXBUF_DISABLE_DEPRECATED=1 -DG_DISABLE_DEPRECATED=1 -I/opt/pkg/include/dbus-1.0 -I/opt/pkg/lib/dbus-1.0/include -I/opt/pkg/include -I/opt/pkg/include/glib-2.0 -I/opt/pkg/lib/glib-2.0/include -pipe -Os -I/opt/pkg/include -I/opt/pkg/include/glib-2.0 -I/opt/pkg/include/gio-unix-2.0 -I/opt/pkg/lib/glib-2.0/include -I/opt/pkg/include/freetype2 -I/opt/pkg/include/harfbuzz -MT mod_notify.o -MD -MP -MF .deps/mod_notify.Tpo -c -o mod_notify.o mod_notify.c
mod_notify.c:92:39: warning: a function declaration without a prototype is deprecated in all versions of C [-Wstrict-prototypes]
static GModule* lookup_dynamic_library()
                                      ^
                                       void
mod_notify.c:113:25: warning: a function declaration without a prototype is deprecated in all versions of C [-Wstrict-prototypes]
gboolean mod_notify_init()
                        ^
                         void
mod_notify.c:160:27: warning: a function declaration without a prototype is deprecated in all versions of C [-Wstrict-prototypes]
gboolean mod_notify_uninit()
                          ^
                           void
3 warnings generated.
mv -f .deps/mod_notify.Tpo .deps/mod_notify.Po
clang -DHAVE_CONFIG_H -I. -I..   -DPNG_NO_ASSEMBLER_CODE -I/opt/pkg/include -I/opt/pkg/include/glib-2.0 -I/opt/pkg/include/gio-unix-2.0 -I/opt/pkg/lib/glib-2.0/include -I/opt/pkg/include/freetype2 -I/opt/pkg/include/harfbuzz -Wall -Wextra -std=c99 -pedantic -Wno-unused-parameter -fstrict-aliasing -Wno-missing-field-initializers -I/opt/pkg/include/gtk-2.0 -I/opt/pkg/lib/gtk-2.0/include -I/opt/pkg/include/pango-1.0 -I/opt/pkg/include/fribidi -I/opt/pkg/include -D_REENTRANT -I/opt/pkg/include/harfbuzz -I/opt/pkg/include/atk-1.0 -I/opt/pkg/include/cairo -I/opt/pkg/include/freetype2 -I/opt/pkg/include/pixman-1 -I/opt/pkg/include/gdk-pixbuf-2.0 -I/opt/pkg/include/libpng16 -I/opt/pkg/include/glib-2.0 -I/opt/pkg/lib/glib-2.0/include -DGTK_DISABLE_DEPRECATED=1 -DGDK_DISABLE_DEPRECATED=1 -DGDK_PIXBUF_DISABLE_DEPRECATED=1 -DG_DISABLE_DEPRECATED=1 -I/opt/pkg/include/dbus-1.0 -I/opt/pkg/lib/dbus-1.0/include -I/opt/pkg/include -I/opt/pkg/include/glib-2.0 -I/opt/pkg/lib/glib-2.0/include -pipe -Os -I/opt/pkg/include -I/opt/pkg/include/glib-2.0 -I/opt/pkg/include/gio-unix-2.0 -I/opt/pkg/lib/glib-2.0/include -I/opt/pkg/include/freetype2 -I/opt/pkg/include/harfbuzz -MT suggestions.o -MD -MP -MF .deps/suggestions.Tpo -c -o suggestions.o suggestions.c
suggestions.c:132:26: warning: a function declaration without a prototype is deprecated in all versions of C [-Wstrict-prototypes]
gboolean suggestions_init()
                         ^
                          void
suggestions.c:213:28: warning: a function declaration without a prototype is deprecated in all versions of C [-Wstrict-prototypes]
gboolean suggestions_uninit()
                           ^
                            void
2 warnings generated.
mv -f .deps/suggestions.Tpo .deps/suggestions.Po
clang -DHAVE_CONFIG_H -I. -I..   -DPNG_NO_ASSEMBLER_CODE -I/opt/pkg/include -I/opt/pkg/include/glib-2.0 -I/opt/pkg/include/gio-unix-2.0 -I/opt/pkg/lib/glib-2.0/include -I/opt/pkg/include/freetype2 -I/opt/pkg/include/harfbuzz -Wall -Wextra -std=c99 -pedantic -Wno-unused-parameter -fstrict-aliasing -Wno-missing-field-initializers -I/opt/pkg/include/gtk-2.0 -I/opt/pkg/lib/gtk-2.0/include -I/opt/pkg/include/pango-1.0 -I/opt/pkg/include/fribidi -I/opt/pkg/include -D_REENTRANT -I/opt/pkg/include/harfbuzz -I/opt/pkg/include/atk-1.0 -I/opt/pkg/include/cairo -I/opt/pkg/include/freetype2 -I/opt/pkg/include/pixman-1 -I/opt/pkg/include/gdk-pixbuf-2.0 -I/opt/pkg/include/libpng16 -I/opt/pkg/include/glib-2.0 -I/opt/pkg/lib/glib-2.0/include -DGTK_DISABLE_DEPRECATED=1 -DGDK_DISABLE_DEPRECATED=1 -DGDK_PIXBUF_DISABLE_DEPRECATED=1 -DG_DISABLE_DEPRECATED=1 -I/opt/pkg/include/dbus-1.0 -I/opt/pkg/lib/dbus-1.0/include -I/opt/pkg/include -I/opt/pkg/include/glib-2.0 -I/opt/pkg/lib/glib-2.0/include -pipe -Os -I/opt/pkg/include -I/opt/pkg/include/glib-2.0 -I/opt/pkg/include/gio-unix-2.0 -I/opt/pkg/lib/glib-2.0/include -I/opt/pkg/include/freetype2 -I/opt/pkg/include/harfbuzz -MT hotkey_editor.o -MD -MP -MF .deps/hotkey_editor.Tpo -c -o hotkey_editor.o hotkey_editor.c
mv -f .deps/hotkey_editor.Tpo .deps/hotkey_editor.Po
clang -DHAVE_CONFIG_H -I. -I..   -DPNG_NO_ASSEMBLER_CODE -I/opt/pkg/include -I/opt/pkg/include/glib-2.0 -I/opt/pkg/include/gio-unix-2.0 -I/opt/pkg/lib/glib-2.0/include -I/opt/pkg/include/freetype2 -I/opt/pkg/include/harfbuzz -Wall -Wextra -std=c99 -pedantic -Wno-unused-parameter -fstrict-aliasing -Wno-missing-field-initializers -I/opt/pkg/include/gtk-2.0 -I/opt/pkg/lib/gtk-2.0/include -I/opt/pkg/include/pango-1.0 -I/opt/pkg/include/fribidi -I/opt/pkg/include -D_REENTRANT -I/opt/pkg/include/harfbuzz -I/opt/pkg/include/atk-1.0 -I/opt/pkg/include/cairo -I/opt/pkg/include/freetype2 -I/opt/pkg/include/pixman-1 -I/opt/pkg/include/gdk-pixbuf-2.0 -I/opt/pkg/include/libpng16 -I/opt/pkg/include/glib-2.0 -I/opt/pkg/lib/glib-2.0/include -DGTK_DISABLE_DEPRECATED=1 -DGDK_DISABLE_DEPRECATED=1 -DGDK_PIXBUF_DISABLE_DEPRECATED=1 -DG_DISABLE_DEPRECATED=1 -I/opt/pkg/include/dbus-1.0 -I/opt/pkg/lib/dbus-1.0/include -I/opt/pkg/include -I/opt/pkg/include/glib-2.0 -I/opt/pkg/lib/glib-2.0/include -pipe -Os -I/opt/pkg/include -I/opt/pkg/include/glib-2.0 -I/opt/pkg/include/gio-unix-2.0 -I/opt/pkg/lib/glib-2.0/include -I/opt/pkg/include/freetype2 -I/opt/pkg/include/harfbuzz -MT gui.o -MD -MP -MF .deps/gui.Tpo -c -o gui.o gui.c
In file included from gui.c:30:
In file included from ./gui.h:32:
/Users/pbulk/build/textproc/artha/work/.buildlink/include/wn.h:334:21: warning: a function declaration without a prototype is deprecated in all versions of C [-Wstrict-prototypes]
extern int morphinit(); 
                    ^
                     void
/Users/pbulk/build/textproc/artha/work/.buildlink/include/wn.h:337:24: warning: a function declaration without a prototype is deprecated in all versions of C [-Wstrict-prototypes]
extern int re_morphinit();      
                       ^
                        void
/Users/pbulk/build/textproc/artha/work/.buildlink/include/wn.h:349:18: warning: a function declaration without a prototype is deprecated in all versions of C [-Wstrict-prototypes]
extern int wninit();            
                 ^
                  void
/Users/pbulk/build/textproc/artha/work/.buildlink/include/wn.h:353:21: warning: a function declaration without a prototype is deprecated in all versions of C [-Wstrict-prototypes]
extern int re_wninit(); 
                    ^
                     void
/Users/pbulk/build/textproc/artha/work/.buildlink/include/wn.h:415:19: warning: a function declaration without a prototype is deprecated in all versions of C [-Wstrict-prototypes]
char *SetSearchdir();
                  ^
                   void
In file included from gui.c:30:
./gui.h:36:10: fatal error: 'gdk/gdkx.h' file not found
#include <gdk/gdkx.h>
         ^~~~~~~~~~~~
5 warnings and 1 error generated.
gmake[2]: *** [Makefile:567: gui.o] Error 1
gmake[2]: Leaving directory '/Users/pbulk/build/textproc/artha/work/artha-1.0.5/src'
gmake[1]: *** [Makefile:416: all-recursive] Error 1
gmake[1]: Leaving directory '/Users/pbulk/build/textproc/artha/work/artha-1.0.5'
gmake: *** [Makefile:348: all] Error 2
*** Error code 2

Stop.
bmake[1]: stopped in /Volumes/data/jenkins/workspace/pkgsrc-macos-trunk-arm64/textproc/artha
*** Error code 1

Stop.
bmake: stopped in /Volumes/data/jenkins/workspace/pkgsrc-macos-trunk-arm64/textproc/artha