=> Bootstrap dependency digest>=20211023: found digest-20220214
===> Building for gama-2.29
/opt/pkg/bin/gmake  all-recursive
gmake[1]: Entering directory '/Users/pbulk/build/geography/gama/work/gama-2.29'
Making all in lib
gmake[2]: Entering directory '/Users/pbulk/build/geography/gama/work/gama-2.29/lib'
  CXX      gnu_gama/e3.o
  CXX      gnu_gama/ellipsoid.o
  CXX      gnu_gama/ellipsoids.o
  CXX      gnu_gama/gon2deg.o
  CXX      gnu_gama/latlong.o
  CXX      gnu_gama/outstream.o
  CXX      gnu_gama/comb.o
  CXX      gnu_gama/simplified.o
  CXX      gnu_gama/statan.o
  CXX      gnu_gama/utf8.o
  CXX      gnu_gama/version.o
  CXX      gnu_gama/adj/adj.o
  CXX      gnu_gama/adj/adj_input_data.o
  CXX      gnu_gama/adj/icgs.o
  CXX      gnu_gama/xml/baseparser.o
  CXX      gnu_gama/xml/comparexyz.o
  CXX      gnu_gama/xml/encoding_cp1251.o
  CXX      gnu_gama/xml/encoding.o
  CXX      gnu_gama/xml/encoding_unknown_handler.o
  CXX      gnu_gama/xml/htmlparser.o
  CXX      gnu_gama/xml/localnetworkoctave.o
  CXX      gnu_gama/xml/localnetworksql.o
  CXX      gnu_gama/xml/localnetworkxml.o
  CXX      gnu_gama/xml/localnetwork_adjustment_results.o
  CXX      gnu_gama/xml/localnetwork_adjustment_results_data.o
  CXX      gnu_gama/xml/gkfparser.o
  CXX      gnu_gama/xml/str2xml.o
  CXX      gnu_gama/local/bearing.o
  CXX      gnu_gama/local/deformation.o
gnu_gama/local/deformation.cpp:294:24: error: implicit instantiation of undefined template 'std::basic_ostringstream<char>'
    std::ostringstream strx;
                       ^
/Library/Developer/CommandLineTools/SDKs/MacOSX11.3.sdk/usr/include/c++/v1/iosfwd:136:32: note: template is declared here
    class _LIBCPP_TEMPLATE_VIS basic_ostringstream;
                               ^
gnu_gama/local/deformation.cpp:300:24: error: implicit instantiation of undefined template 'std::basic_ostringstream<char>'
    std::ostringstream stry;
                       ^
/Library/Developer/CommandLineTools/SDKs/MacOSX11.3.sdk/usr/include/c++/v1/iosfwd:136:32: note: template is declared here
    class _LIBCPP_TEMPLATE_VIS basic_ostringstream;
                               ^
gnu_gama/local/deformation.cpp:306:24: error: implicit instantiation of undefined template 'std::basic_ostringstream<char>'
    std::ostringstream strz;
                       ^
/Library/Developer/CommandLineTools/SDKs/MacOSX11.3.sdk/usr/include/c++/v1/iosfwd:136:32: note: template is declared here
    class _LIBCPP_TEMPLATE_VIS basic_ostringstream;
                               ^
3 errors generated.
gmake[2]: *** [Makefile:1356: gnu_gama/local/deformation.o] Error 1
gmake[2]: Leaving directory '/Users/pbulk/build/geography/gama/work/gama-2.29/lib'
gmake[1]: *** [Makefile:382: all-recursive] Error 1
gmake[1]: Leaving directory '/Users/pbulk/build/geography/gama/work/gama-2.29'
gmake: *** [Makefile:323: all] Error 2
*** Error code 2

Stop.
bmake[1]: stopped in /Volumes/data/jenkins/workspace/pkgsrc-macos11-trunk-arm64/geography/gama
*** Error code 1

Stop.
bmake: stopped in /Volumes/data/jenkins/workspace/pkgsrc-macos11-trunk-arm64/geography/gama