=> Bootstrap dependency digest>=20211023: found digest-20220214
===> Building for ann-1.1.2
cd src ; /opt/pkg/bin/gmake macosx-g++
gmake[1]: Entering directory '/Users/pbulk/build/wip/ann/work/ann_1.1.2/src'
/opt/pkg/bin/gmake targets \
"ANNLIB = libANN.a" \
"C++ = g++" \
"CFLAGS = -O3" \
"MAKELIB = libtool -static -o " \
"RANLIB = true"
gmake[2]: Entering directory '/Users/pbulk/build/wip/ann/work/ann_1.1.2/src'
g++ -c -I../include -O3 ANN.cpp
g++ -c -I../include -O3 brute.cpp
g++ -c -I../include -O3 kd_tree.cpp
g++ -c -I../include -O3 kd_util.cpp
g++ -c -I../include -O3 kd_split.cpp
g++ -c -I../include -O3 kd_dump.cpp
g++ -c -I../include -O3 kd_search.cpp
g++ -c -I../include -O3 kd_pr_search.cpp
g++ -c -I../include -O3 kd_fix_rad_search.cpp
g++ -c -I../include -O3 bd_tree.cpp
g++ -c -I../include -O3 bd_search.cpp
g++ -c -I../include -O3 bd_pr_search.cpp
g++ -c -I../include -O3 bd_fix_rad_search.cpp
g++ -c -I../include -O3 perf.cpp
libtool -static -o  libANN.a ANN.o brute.o kd_tree.o kd_util.o kd_split.o kd_dump.o kd_search.o kd_pr_search.o kd_fix_rad_search.o bd_tree.o bd_search.o bd_pr_search.o bd_fix_rad_search.o perf.o
libtool: Missing --mode=XXX
gmake[2]: *** [Makefile:57: ../lib/libANN.a] Error 255
gmake[2]: Leaving directory '/Users/pbulk/build/wip/ann/work/ann_1.1.2/src'
gmake[1]: *** [../Make-config:81: macosx-g++] Error 2
gmake[1]: Leaving directory '/Users/pbulk/build/wip/ann/work/ann_1.1.2/src'
gmake: *** [Makefile:60: macosx-g++] Error 2
*** Error code 2

Stop.
bmake[1]: stopped in /Volumes/data/jenkins/workspace/pkgsrc-macos11-trunk-arm64/wip/ann
*** Error code 1

Stop.
bmake: stopped in /Volumes/data/jenkins/workspace/pkgsrc-macos11-trunk-arm64/wip/ann