+ case "${usergroup_phase}" in + local run_cmd + run_cmd=run_su + shift + run_su /opt/local/bin/bmake all BATCH=1 DEPENDS_TARGET=/nonexistent WRKLOG=/tmp/bulklog/tio-1.32/work.log + su pbulk -c '"$@"' make /opt/local/bin/bmake all BATCH=1 DEPENDS_TARGET=/nonexistent WRKLOG=/tmp/bulklog/tio-1.32/work.log => Bootstrap dependency digest>=20211023: found digest-20211023 ===> Building for tio-1.32 Making all in src CC tty.o tty.c: In function 'tty_connect': tty.c:615:13: warning: implicit declaration of function 'MAX' [-Wimplicit-function-declaration] 615 | maxfd = MAX(fd, STDIN_FILENO) + 1; /* Maximum bit entry (fd) to test */ | ^~~ CC options.o CC time.o CC main.o CC log.o CC error.o CCLD tio Undefined first referenced symbol in file MAX tty.o ld: fatal: symbol referencing errors. No output written to tio collect2: error: ld returned 1 exit status *** [tio] Error code 1 bmake[1]: stopped in /home/pbulk/build/comms/tio/work/tio-1.32/src 1 error bmake[1]: stopped in /home/pbulk/build/comms/tio/work/tio-1.32/src *** [all-recursive] Error code 1 bmake: stopped in /home/pbulk/build/comms/tio/work/tio-1.32 1 error bmake: stopped in /home/pbulk/build/comms/tio/work/tio-1.32 *** Error code 2 Stop. bmake[1]: stopped in /data/jenkins/workspace/pkgsrc-2021Q4-x86_64/comms/tio *** Error code 1 Stop. bmake: stopped in /data/jenkins/workspace/pkgsrc-2021Q4-x86_64/comms/tio